{"text_format":"1","workbook":"xlsx","n_sheets":9,"sheets":["Instructions","Step1","Efficiency Meta-analysis","Step2","Step3","Step4","ForATE Index","Print","Liste"],"not_rendered":{"charts":3,"images":9,"macros":1,"external_links":0,"defined_names":1,"comments":0,"pivot_tables":0},"unopened":[],"bounds":{"document_bytes":16777216,"sheet_cells":100000,"rows_first":2000,"rows_last":500,"rows_between":2000,"halvings":0,"cell_chars":16384,"cell_head_chars":4096},"cells_cut":0,"cells_raw":0,"read":"whole","date_system":"1900"}

{"sheet":"Instructions","index":0,"n_rows":21,"n_cols":6,"rows_kept":21,"cut":false,"hidden":false,"merged":[[20,0,20,2],[20,5,20,7],[1,1,2,9],[4,1,13,9],[16,0,16,2],[16,5,16,7],[14,1,15,9]]}
[]
[null,"Instructions"]
[]
[]
[null,"Use the different steps to calculate each individual indexes. In each tab, enter the data needed in the gray text areas. Specific instructions may be added in some tabs. If you want to assess a forensic chemical technique, please use the ForATE Chemical Index Calculator file."]
[]
[]
[]
[]
[]
[]
[]
[]
[]
[null,"File legend"]
[]
["Color of the areas to fill :",null,null,null,null,"Specific instructions :"]
[]
[]
[]
["Buttons for specials actions :",null,null,null,null,"Navigation arrows :"]

{"sheet":"Step1","index":1,"n_rows":2604,"n_cols":17,"rows_kept":2604,"cut":false,"hidden":false,"merged":[[1,0,1,1],[1,6,6,21],[8,6,26,10],[3,0,3,3],[5,0,5,3],[1,3,1,4]]}
[]
["Efficiency index",null,"=",{"$f":"IFERROR(10^ABS(3*(((N9/(E4*M9))+N14)/2)),\"Waiting for data\")","v":"Waiting for data"},null,{"$f":"LOG(D2)","v":{"$error":"#VALUE!"}}]
[]
["Number of marks/stains planted for each sample",null,null,null,"Enter data"]
[]
["Number of samples",null,null,null,"Enter data"]
[]
[null,"Technique used","Nb of fingermarks found","xy","s2x calc","s2y calc",null,null,null,null,null,null,"Somme X","Somme y"]
[null,0,0,{"$f":"B9*C9","v":0},{"$f":"(B9-$M$11)*(B9-$M$11)","v":0},{"$f":"(C9-$N$11)*(C9-$N$11)","v":0},null,null,null,null,null,null,{"$f":"SUM(B9:B2604)","v":0},{"$f":"SUM(C9:C2604)","v":0}]
[null,0,0,{"$f":"B10*C10","v":0},{"$f":"(B10-$M$11)*(B10-$M$11)","v":0},{"$f":"(C10-$N$11)*(C10-$N$11)","v":0},null,null,null,null,null,null,"Moyenne X","Moyenne Y"]
[null,0,0,{"$f":"B11*C11","v":0},{"$f":"(B11-$M$11)*(B11-$M$11)","v":0},{"$f":"(C11-$N$11)*(C11-$N$11)","v":0},null,null,null,null,null,null,{"$f":"AVERAGE(B9:B2604)","v":0},{"$f":"AVERAGE(C9:C2604)","v":0}]
[null,0,0,{"$f":"B12*C12","v":0},{"$f":"(B12-$M$11)*(B12-$M$11)","v":0},0]
[null,0,0,0,0,0,null,null,null,null,null,null,"Sxy","r"]
[null,0,0,0,0,0,null,null,null,null,null,null,{"$f":"((2595*M17)-(M9*N9))/(2595*(2595-1))","v":0},{"$f":"M14/(SQRT(N17)*SQRT(O17))","v":{"$error":"#DIV/0!"}}]
[null,0,0,0,0,0]
[null,0,0,0,0,0,null,null,null,null,null,null,"Total xy","Total s2x","Total s2y"]
[null,0,0,0,0,0,null,null,null,null,null,null,{"$f":"SUM(D9:D2604)","v":0},{"$f":"SUM(E9:E2604)/(2595-1)","v":0},{"$f":"SUM(F9:F2604)/(2595-1)","v":0}]
[null,0,0,0,0,0]
[null,0,0,0,0,0,null,null,null,null,null,null,"Nombre d'échantillon total"]
[null,0,0,0,0,0,null,null,null,null,null,null,{"$f":"2602-7","v":2595}]
[null,0,0,0,0,0]
[null,0,0,0,0,0]
[null,0,0,0,0,0,null,null,null,null,null,null,null,{"$f":"N9/(E4*M9)","v":{"$error":"#VALUE!"}},{"$f":"N23*N14","v":{"$error":"#VALUE!"}},{"$f":"O23*3","v":{"$error":"#VALUE!"}},{"$f":"10^P23","v":{"$error":"#VALUE!"}}]
[null,0,0,0,0,0]
[null,0,0,0,0,0]
[null,0,0,0,0,0]
[null,0,0,0,0,0]
[null,0,0,0,0,0]
[null,0,0,0,0,0]
[null,0,0,0,0,0]
[null,0,0,0,0,0]
[null,0,0,0,0,0]
[null,0,0,0,0,0]
[null,0,0,0,0,0]
[null,0,0,0,0,0]
[null,0,0,0,0,0]
[null,0,0,0,0,0]
[null,0,0,0,0,0]
[null,0,0,0,0,0]
[null,0,0,0,0,0]
[null,0,0,0,0,0]
[null,0,0,0,0,0]
[null,0,0,0,0,0]
[null,0,0,0,0,0]
[null,0,0,0,0,0]
[null,0,0,0,0,0]
[null,0,0,0,0,0]
[null,0,0,0,0,0]
[null,0,0,0,0,0]
[null,0,0,0,0,0]
[null,0,0,0,0,0]
[null,0,0,0,0,0]
[null,0,0,0,0,0]
[null,0,0,0,0,0]
[null,0,0,0,0,0]
[null,0,0,0,0,0]
[null,0,0,0,0,0]
[null,0,0,0,0,0]
[null,0,0,0,0,0]
[null,0,0,0,0,0]
[null,0,0,0,0,0]
[null,0,0,0,0,0]
[null,0,0,0,0,0]
[null,0,0,0,0,0]
[null,0,0,0,0,0]
[null,0,0,0,0,0]
[null,0,0,0,0,0]
[null,0,0,0,0,0]
[null,0,0,0,0,0]
[null,0,0,0,0,0]
[null,0,0,0,0,0]
[null,0,0,0,0,0]
[null,0,0,0,0,0]
[null,0,0,0,0,0]
[null,0,0,0,0,{"$f":"(C75-$N$11)*(C75-$N$11)","v":0}]
[null,0,0,{"$f":"B76*C76","v":0},{"$f":"(B76-$M$11)*(B76-$M$11)","v":0},0]
[null,0,0,0,0,0]
[null,0,0,0,0,0]
[null,0,0,0,0,0]
[null,0,0,0,0,0]
[null,0,0,0,0,0]
[null,0,0,0,0,0]
[null,0,0,0,0,0]
[null,0,0,0,0,0]
[null,0,0,0,0,0]
[null,0,0,0,0,0]
[null,0,0,0,0,0]
[null,0,0,0,0,0]
[null,0,0,0,0,0]
[null,0,0,0,0,0]
[null,0,0,0,0,0]
[null,0,0,0,0,0]
[null,0,0,0,0,0]
[null,0,0,0,0,0]
[null,0,0,0,0,0]
[null,0,0,0,0,0]
[null,0,0,0,0,0]
[null,0,0,0,0,0]
[null,0,0,0,0,0]
[null,0,0,0,0,0]
[null,0,0,0,0,0]
[null,0,0,0,0,0]
[null,0,0,0,0,0]
[null,0,0,0,0,0]
[null,0,0,0,0,0]
[null,0,0,0,0,0]
[null,0,0,0,0,0]
[null,0,0,0,0,0]
[null,0,0,0,0,0]
[null,0,0,0,0,0]
[null,0,0,0,0,0]
[null,0,0,0,0,0]
[null,0,0,0,0,0]
[null,0,0,0,0,0]
[null,0,0,0,0,0]
[null,0,0,0,0,0]
[null,0,0,0,0,0]
[null,0,0,0,0,0]
[null,0,0,0,0,0]
[null,0,0,0,0,0]
[null,0,0,0,0,0]
[null,0,0,0,0,0]
[null,0,0,0,0,0]
[null,0,0,0,0,0]
[null,0,0,0,0,0]
[null,0,0,0,0,0]
[null,0,0,0,0,0]
[null,0,0,0,0,0]
[null,0,0,0,0,0]
[null,0,0,0,0,0]
[null,0,0,0,0,0]
[null,0,0,0,0,0]
[null,0,0,0,0,0]
[null,0,0,0,0,0]
[null,0,0,0,0,0]
[null,0,0,0,0,0]
[null,0,0,0,0,0]
[null,0,0,0,0,0]
[null,0,0,0,0,{"$f":"(C139-$N$11)*(C139-$N$11)","v":0}]
[null,0,0,{"$f":"B140*C140","v":0},{"$f":"(B140-$M$11)*(B140-$M$11)","v":0},0]
[null,0,0,0,0,0]
[null,0,0,0,0,0]
[null,0,0,0,0,0]
[null,0,0,0,0,0]
[null,0,0,0,0,0]
[null,0,0,0,0,0]
[null,0,0,0,0,0]
[null,0,0,0,0,0]
[null,0,0,0,0,0]
[null,0,0,0,0,0]
[null,0,0,0,0,0]
[null,0,0,0,0,0]
[null,0,0,0,0,0]
[null,0,0,0,0,0]
[null,0,0,0,0,0]
[null,0,0,0,0,0]
[null,0,0,0,0,0]
[null,0,0,0,0,0]
[null,0,0,0,0,0]
[null,0,0,0,0,0]
[null,0,0,0,0,0]
[null,0,0,0,0,0]
[null,0,0,0,0,0]
[null,0,0,0,0,0]
[null,0,0,0,0,0]
[null,0,0,0,0,0]
[null,0,0,0,0,0]
[null,0,0,0,0,0]
[null,0,0,0,0,0]
[null,0,0,0,0,0]
[null,0,0,0,0,0]
[null,0,0,0,0,0]
[null,0,0,0,0,0]
[null,0,0,0,0,0]
[null,0,0,0,0,0]
[null,0,0,0,0,0]
[null,0,0,0,0,0]
[null,0,0,0,0,0]
[null,0,0,0,0,0]
[null,0,0,0,0,0]
[null,0,0,0,0,0]
[null,0,0,0,0,0]
[null,0,0,0,0,0]
[null,0,0,0,0,0]
[null,0,0,0,0,0]
[null,0,0,0,0,0]
[null,0,0,0,0,0]
[null,0,0,0,0,0]
[null,0,0,0,0,0]
[null,0,0,0,0,0]
[null,0,0,0,0,0]
[null,0,0,0,0,0]
[null,0,0,0,0,0]
[null,0,0,0,0,0]
[null,0,0,0,0,0]
[null,0,0,0,0,0]
[null,0,0,0,0,0]
[null,0,0,0,0,0]
[null,0,0,0,0,0]
[null,0,0,0,0,0]
[null,0,0,0,0,0]
[null,0,0,0,0,0]
[null,0,0,0,0,{"$f":"(C203-$N$11)*(C203-$N$11)","v":0}]
[null,0,0,{"$f":"B204*C204","v":0},{"$f":"(B204-$M$11)*(B204-$M$11)","v":0},0]
[null,0,0,0,0,0]
[null,0,0,0,0,0]
[null,0,0,0,0,0]
[null,0,0,0,0,0]
[null,0,0,0,0,0]
[null,0,0,0,0,0]
[null,0,0,0,0,0]
[null,0,0,0,0,0]
[null,0,0,0,0,0]
[null,0,0,0,0,0]
[null,0,0,0,0,0]
[null,0,0,0,0,0]
[null,0,0,0,0,0]
[null,0,0,0,0,0]
[null,0,0,0,0,0]
[null,0,0,0,0,0]
[null,0,0,0,0,0]
[null,0,0,0,0,0]
[null,0,0,0,0,0]
[null,0,0,0,0,0]
[null,0,0,0,0,0]
[null,0,0,0,0,0]
[null,0,0,0,0,0]
[null,0,0,0,0,0]
[null,0,0,0,0,0]
[null,0,0,0,0,0]
[null,0,0,0,0,0]
[null,0,0,0,0,0]
[null,0,0,0,0,0]
[null,0,0,0,0,0]
[null,0,0,0,0,0]
[null,0,0,0,0,0]
[null,0,0,0,0,0]
[null,0,0,0,0,0]
[null,0,0,0,0,0]
[null,0,0,0,0,0]
[null,0,0,0,0,0]
[null,0,0,0,0,0]
[null,0,0,0,0,0]
[null,0,0,0,0,0]
[null,0,0,0,0,0]
[null,0,0,0,0,0]
[null,0,0,0,0,0]
[null,0,0,0,0,0]
[null,0,0,0,0,0]
[null,0,0,0,0,0]
[null,0,0,0,0,0]
[null,0,0,0,0,0]
[null,0,0,0,0,0]
[null,0,0,0,0,0]
[null,0,0,0,0,0]
[null,0,0,0,0,0]
[null,0,0,0,0,0]
[null,0,0,0,0,0]
[null,0,0,0,0,0]
[null,0,0,0,0,0]
[null,0,0,0,0,0]
[null,0,0,0,0,0]
[null,0,0,0,0,0]
[null,0,0,0,0,0]
[null,0,0,0,0,0]
[null,0,0,0,0,0]
[null,0,0,0,0,{"$f":"(C267-$N$11)*(C267-$N$11)","v":0}]
[null,0,0,{"$f":"B268*C268","v":0},{"$f":"(B268-$M$11)*(B268-$M$11)","v":0},0]
[null,0,0,0,0,0]
[null,0,0,0,0,0]
[null,0,0,0,0,0]
[null,0,0,0,0,0]
[null,0,0,0,0,0]
[null,0,0,0,0,0]
[null,0,0,0,0,0]
[null,0,0,0,0,0]
[null,0,0,0,0,0]
[null,0,0,0,0,0]
[null,0,0,0,0,0]
[null,0,0,0,0,0]
[null,0,0,0,0,0]
[null,0,0,0,0,0]
[null,0,0,0,0,0]
[null,0,0,0,0,0]
[null,0,0,0,0,0]
[null,0,0,0,0,0]
[null,0,0,0,0,0]
[null,0,0,0,0,0]
[null,0,0,0,0,0]
[null,0,0,0,0,0]
[null,0,0,0,0,0]
[null,0,0,0,0,0]
[null,0,0,0,0,0]
[null,0,0,0,0,0]
[null,0,0,0,0,0]
[null,0,0,0,0,0]
[null,0,0,0,0,0]
[null,0,0,0,0,0]
[null,0,0,0,0,0]
[null,0,0,0,0,0]
[null,0,0,0,0,0]
[null,0,0,0,0,0]
[null,0,0,0,0,0]
[null,0,0,0,0,0]
[null,0,0,0,0,0]
[null,0,0,0,0,0]
[null,0,0,0,0,0]
[null,0,0,0,0,0]
[null,0,0,0,0,0]
[null,0,0,0,0,0]
[null,0,0,0,0,0]
[null,0,0,0,0,0]
[null,0,0,0,0,0]
[null,0,0,0,0,0]
[null,0,0,0,0,0]
[null,0,0,0,0,0]
[null,0,0,0,0,0]
[null,0,0,0,0,0]
[null,0,0,0,0,0]
[null,0,0,0,0,0]
[null,0,0,0,0,0]
[null,0,0,0,0,0]
[null,0,0,0,0,0]
[null,0,0,0,0,0]
[null,0,0,0,0,0]
[null,0,0,0,0,0]
[null,0,0,0,0,0]
[null,0,0,0,0,0]
[null,0,0,0,0,0]
[null,0,0,0,0,0]
[null,0,0,0,0,{"$f":"(C331-$N$11)*(C331-$N$11)","v":0}]
[null,0,0,{"$f":"B332*C332","v":0},{"$f":"(B332-$M$11)*(B332-$M$11)","v":0},0]
[null,0,0,0,0,0]
[null,0,0,0,0,0]
[null,0,0,0,0,0]
[null,0,0,0,0,0]
[null,0,0,0,0,0]
[null,0,0,0,0,0]
[null,0,0,0,0,0]
[null,0,0,0,0,0]
[null,0,0,0,0,0]
[null,0,0,0,0,0]
[null,0,0,0,0,0]
[null,0,0,0,0,0]
[null,0,0,0,0,0]
[null,0,0,0,0,0]
[null,0,0,0,0,0]
[null,0,0,0,0,0]
[null,0,0,0,0,0]
[null,0,0,0,0,0]
[null,0,0,0,0,0]
[null,0,0,0,0,0]
[null,0,0,0,0,0]
[null,0,0,0,0,0]
[null,0,0,0,0,0]
[null,0,0,0,0,0]
[null,0,0,0,0,0]
[null,0,0,0,0,0]
[null,0,0,0,0,0]
[null,0,0,0,0,0]
[null,0,0,0,0,0]
[null,0,0,0,0,0]
[null,0,0,0,0,0]
[null,0,0,0,0,0]
[null,0,0,0,0,0]
[null,0,0,0,0,0]
[null,0,0,0,0,0]
[null,0,0,0,0,0]
[null,0,0,0,0,0]
[null,0,0,0,0,0]
[null,0,0,0,0,0]
[null,0,0,0,0,0]
[null,0,0,0,0,0]
[null,0,0,0,0,0]
[null,0,0,0,0,0]
[null,0,0,0,0,0]
[null,0,0,0,0,0]
[null,0,0,0,0,0]
[null,0,0,0,0,0]
[null,0,0,0,0,0]
[null,0,0,0,0,0]
[null,0,0,0,0,0]
[null,0,0,0,0,0]
[null,0,0,0,0,0]
[null,0,0,0,0,0]
[null,0,0,0,0,0]
[null,0,0,0,0,0]
[null,0,0,0,0,0]
[null,0,0,0,0,0]
[null,0,0,0,0,0]
[null,0,0,0,0,0]
[null,0,0,0,0,0]
[null,0,0,0,0,0]
[null,0,0,0,0,0]
[null,0,0,0,0,{"$f":"(C395-$N$11)*(C395-$N$11)","v":0}]
[null,0,0,{"$f":"B396*C396","v":0},{"$f":"(B396-$M$11)*(B396-$M$11)","v":0},0]
[null,0,0,0,0,0]
[null,0,0,0,0,0]
[null,0,0,0,0,0]
[null,0,0,0,0,0]
[null,0,0,0,0,0]
[null,0,0,0,0,0]
[null,0,0,0,0,0]
[null,0,0,0,0,0]
[null,0,0,0,0,0]
[null,0,0,0,0,0]
[null,0,0,0,0,0]
[null,0,0,0,0,0]
[null,0,0,0,0,0]
[null,0,0,0,0,0]
[null,0,0,0,0,0]
[null,0,0,0,0,0]
[null,0,0,0,0,0]
[null,0,0,0,0,0]
[null,0,0,0,0,0]
[null,0,0,0,0,0]
[null,0,0,0,0,0]
[null,0,0,0,0,0]
[null,0,0,0,0,0]
[null,0,0,0,0,0]
[null,0,0,0,0,0]
[null,0,0,0,0,0]
[null,0,0,0,0,0]
[null,0,0,0,0,0]
[null,0,0,0,0,0]
[null,0,0,0,0,0]
[null,0,0,0,0,0]
[null,0,0,0,0,0]
[null,0,0,0,0,0]
[null,0,0,0,0,0]
[null,0,0,0,0,0]
[null,0,0,0,0,0]
[null,0,0,0,0,0]
[null,0,0,0,0,0]
[null,0,0,0,0,0]
[null,0,0,0,0,0]
[null,0,0,0,0,0]
[null,0,0,0,0,0]
[null,0,0,0,0,0]
[null,0,0,0,0,0]
[null,0,0,0,0,0]
[null,0,0,0,0,0]
[null,0,0,0,0,0]
[null,0,0,0,0,0]
[null,0,0,0,0,0]
[null,0,0,0,0,0]
[null,0,0,0,0,0]
[null,0,0,0,0,0]
[null,0,0,0,0,0]
[null,0,0,0,0,0]
[null,0,0,0,0,0]
[null,0,0,0,0,0]
[null,0,0,0,0,0]
[null,0,0,0,0,0]
[null,0,0,0,0,0]
[null,0,0,0,0,0]
[null,0,0,0,0,0]
[null,0,0,0,0,0]
[null,0,0,0,0,{"$f":"(C459-$N$11)*(C459-$N$11)","v":0}]
[null,0,0,{"$f":"B460*C460","v":0},{"$f":"(B460-$M$11)*(B460-$M$11)","v":0},0]
[null,0,0,0,0,0]
[null,0,0,0,0,0]
[null,0,0,0,0,0]
[null,0,0,0,0,0]
[null,0,0,0,0,0]
[null,0,0,0,0,0]
[null,0,0,0,0,0]
[null,0,0,0,0,0]
[null,0,0,0,0,0]
[null,0,0,0,0,0]
[null,0,0,0,0,0]
[null,0,0,0,0,0]
[null,0,0,0,0,0]
[null,0,0,0,0,0]
[null,0,0,0,0,0]
[null,0,0,0,0,0]
[null,0,0,0,0,0]
[null,0,0,0,0,0]
[null,0,0,0,0,0]
[null,0,0,0,0,0]
[null,0,0,0,0,0]
[null,0,0,0,0,0]
[null,0,0,0,0,0]
[null,0,0,0,0,0]
[null,0,0,0,0,0]
[null,0,0,0,0,0]
[null,0,0,0,0,0]
[null,0,0,0,0,0]
[null,0,0,0,0,0]
[null,0,0,0,0,0]
[null,0,0,0,0,0]
[null,0,0,0,0,0]
[null,0,0,0,0,0]
[null,0,0,0,0,0]
[null,0,0,0,0,0]
[null,0,0,0,0,0]
[null,0,0,0,0,0]
[null,0,0,0,0,0]
[null,0,0,0,0,0]
[null,0,0,0,0,0]
[null,0,0,0,0,0]
[null,0,0,0,0,0]
[null,0,0,0,0,0]
[null,0,0,0,0,0]
[null,0,0,0,0,0]
[null,0,0,0,0,0]
[null,0,0,0,0,0]
[null,0,0,0,0,0]
[null,0,0,0,0,0]
[null,0,0,0,0,0]
[null,0,0,0,0,0]
[null,0,0,0,0,0]
[null,0,0,0,0,0]
[null,0,0,0,0,0]
[null,0,0,0,0,0]
[null,0,0,0,0,0]
[null,0,0,0,0,0]
[null,0,0,0,0,0]
[null,0,0,0,0,0]
[null,0,0,0,0,0]
[null,0,0,0,0,0]
[null,0,0,0,0,0]
[null,0,0,0,0,{"$f":"(C523-$N$11)*(C523-$N$11)","v":0}]
[null,0,0,{"$f":"B524*C524","v":0},{"$f":"(B524-$M$11)*(B524-$M$11)","v":0},0]
[null,0,0,0,0,0]
[null,0,0,0,0,0]
[null,0,0,0,0,0]
[null,0,0,0,0,0]
[null,0,0,0,0,0]
[null,0,0,0,0,0]
[null,0,0,0,0,0]
[null,0,0,0,0,0]
[null,0,0,0,0,0]
[null,0,0,0,0,0]
[null,0,0,0,0,0]
[null,0,0,0,0,0]
[null,0,0,0,0,0]
[null,0,0,0,0,0]
[null,0,0,0,0,0]
[null,0,0,0,0,0]
[null,0,0,0,0,0]
[null,0,0,0,0,0]
[null,0,0,0,0,0]
[null,0,0,0,0,0]
[null,0,0,0,0,0]
[null,0,0,0,0,0]
[null,0,0,0,0,0]
[null,0,0,0,0,0]
[null,0,0,0,0,0]
[null,0,0,0,0,0]
[null,0,0,0,0,0]
[null,0,0,0,0,0]
[null,0,0,0,0,0]
[null,0,0,0,0,0]
[null,0,0,0,0,0]
[null,0,0,0,0,0]
[null,0,0,0,0,0]
[null,0,0,0,0,0]
[null,0,0,0,0,0]
[null,0,0,0,0,0]
[null,0,0,0,0,0]
[null,0,0,0,0,0]
[null,0,0,0,0,0]
[null,0,0,0,0,0]
[null,0,0,0,0,0]
[null,0,0,0,0,0]
[null,0,0,0,0,0]
[null,0,0,0,0,0]
[null,0,0,0,0,0]
[null,0,0,0,0,0]
[null,0,0,0,0,0]
[null,0,0,0,0,0]
[null,0,0,0,0,0]
[null,0,0,0,0,0]
[null,0,0,0,0,0]
[null,0,0,0,0,0]
[null,0,0,0,0,0]
[null,0,0,0,0,0]
[null,0,0,0,0,0]
[null,0,0,0,0,0]
[null,0,0,0,0,0]
[null,0,0,0,0,0]
[null,0,0,0,0,0]
[null,0,0,0,0,0]
[null,0,0,0,0,0]
[null,0,0,0,0,0]
[null,0,0,0,0,{"$f":"(C587-$N$11)*(C587-$N$11)","v":0}]
[null,0,0,{"$f":"B588*C588","v":0},{"$f":"(B588-$M$11)*(B588-$M$11)","v":0},0]
[null,0,0,0,0,0]
[null,0,0,0,0,0]
[null,0,0,0,0,0]
[null,0,0,0,0,0]
[null,0,0,0,0,0]
[null,0,0,0,0,0]
[null,0,0,0,0,0]
[null,0,0,0,0,0]
[null,0,0,0,0,0]
[null,0,0,0,0,0]
[null,0,0,0,0,0]
[null,0,0,0,0,0]
[null,0,0,0,0,0]
[null,0,0,0,0,0]
[null,0,0,0,0,0]
[null,0,0,0,0,0]
[null,0,0,0,0,0]
[null,0,0,0,0,0]
[null,0,0,0,0,0]
[null,0,0,0,0,0]
[null,0,0,0,0,0]
[null,0,0,0,0,0]
[null,0,0,0,0,0]
[null,0,0,0,0,0]
[null,0,0,0,0,0]
[null,0,0,0,0,0]
[null,0,0,0,0,0]
[null,0,0,0,0,0]
[null,0,0,0,0,0]
[null,0,0,0,0,0]
[null,0,0,0,0,0]
[null,0,0,0,0,0]
[null,0,0,0,0,0]
[null,0,0,0,0,0]
[null,0,0,0,0,0]
[null,0,0,0,0,0]
[null,0,0,0,0,0]
[null,0,0,0,0,0]
[null,0,0,0,0,0]
[null,0,0,0,0,0]
[null,0,0,0,0,0]
[null,0,0,0,0,0]
[null,0,0,0,0,0]
[null,0,0,0,0,0]
[null,0,0,0,0,0]
[null,0,0,0,0,0]
[null,0,0,0,0,0]
[null,0,0,0,0,0]
[null,0,0,0,0,0]
[null,0,0,0,0,0]
[null,0,0,0,0,0]
[null,0,0,0,0,0]
[null,0,0,0,0,0]
[null,0,0,0,0,0]
[null,0,0,0,0,0]
[null,0,0,0,0,0]
[null,0,0,0,0,0]
[null,0,0,0,0,0]
[null,0,0,0,0,0]
[null,0,0,0,0,0]
[null,0,0,0,0,0]
[null,0,0,0,0,0]
[null,0,0,0,0,{"$f":"(C651-$N$11)*(C651-$N$11)","v":0}]
[null,0,0,{"$f":"B652*C652","v":0},{"$f":"(B652-$M$11)*(B652-$M$11)","v":0},0]
[null,0,0,0,0,0]
[null,0,0,0,0,0]
[null,0,0,0,0,0]
[null,0,0,0,0,0]
[null,0,0,0,0,0]
[null,0,0,0,0,0]
[null,0,0,0,0,0]
[null,0,0,0,0,0]
[null,0,0,0,0,0]
[null,0,0,0,0,0]
[null,0,0,0,0,0]
[null,0,0,0,0,0]
[null,0,0,0,0,0]
[null,0,0,0,0,0]
[null,0,0,0,0,0]
[null,0,0,0,0,0]
[null,0,0,0,0,0]
[null,0,0,0,0,0]
[null,0,0,0,0,0]
[null,0,0,0,0,0]
[null,0,0,0,0,0]
[null,0,0,0,0,0]
[null,0,0,0,0,0]
[null,0,0,0,0,0]
[null,0,0,0,0,0]
[null,0,0,0,0,0]
[null,0,0,0,0,0]
[null,0,0,0,0,0]
[null,0,0,0,0,0]
[null,0,0,0,0,0]
[null,0,0,0,0,0]
[null,0,0,0,0,0]
[null,0,0,0,0,0]
[null,0,0,0,0,0]
[null,0,0,0,0,0]
[null,0,0,0,0,0]
[null,0,0,0,0,0]
[null,0,0,0,0,0]
[null,0,0,0,0,0]
[null,0,0,0,0,0]
[null,0,0,0,0,0]
[null,0,0,0,0,0]
[null,0,0,0,0,0]
[null,0,0,0,0,0]
[null,0,0,0,0,0]
[null,0,0,0,0,0]
[null,0,0,0,0,0]
[null,0,0,0,0,0]
[null,0,0,0,0,0]
[null,0,0,0,0,0]
[null,0,0,0,0,0]
[null,0,0,0,0,0]
[null,0,0,0,0,0]
[null,0,0,0,0,0]
[null,0,0,0,0,0]
[null,0,0,0,0,0]
[null,0,0,0,0,0]
[null,0,0,0,0,0]
[null,0,0,0,0,0]
[null,0,0,0,0,0]
[null,0,0,0,0,0]
[null,0,0,0,0,0]
[null,0,0,0,0,{"$f":"(C715-$N$11)*(C715-$N$11)","v":0}]
[null,0,0,{"$f":"B716*C716","v":0},{"$f":"(B716-$M$11)*(B716-$M$11)","v":0},0]
[null,0,0,0,0,0]
[null,0,0,0,0,0]
[null,0,0,0,0,0]
[null,0,0,0,0,0]
[null,0,0,0,0,0]
[null,0,0,0,0,0]
[null,0,0,0,0,0]
[null,0,0,0,0,0]
[null,0,0,0,0,0]
[null,0,0,0,0,0]
[null,0,0,0,0,0]
[null,0,0,0,0,0]
[null,0,0,0,0,0]
[null,0,0,0,0,0]
[null,0,0,0,0,0]
[null,0,0,0,0,0]
[null,0,0,0,0,0]
[null,0,0,0,0,0]
[null,0,0,0,0,0]
[null,0,0,0,0,0]
[null,0,0,0,0,0]
[null,0,0,0,0,0]
[null,0,0,0,0,0]
[null,0,0,0,0,0]
[null,0,0,0,0,0]
[null,0,0,0,0,0]
[null,0,0,0,0,0]
[null,0,0,0,0,0]
[null,0,0,0,0,0]
[null,0,0,0,0,0]
[null,0,0,0,0,0]
[null,0,0,0,0,0]
[null,0,0,0,0,0]
[null,0,0,0,0,0]
[null,0,0,0,0,0]
[null,0,0,0,0,0]
[null,0,0,0,0,0]
[null,0,0,0,0,0]
[null,0,0,0,0,0]
[null,0,0,0,0,0]
[null,0,0,0,0,0]
[null,0,0,0,0,0]
[null,0,0,0,0,0]
[null,0,0,0,0,0]
[null,0,0,0,0,0]
[null,0,0,0,0,0]
[null,0,0,0,0,0]
[null,0,0,0,0,0]
[null,0,0,0,0,0]
[null,0,0,0,0,0]
[null,0,0,0,0,0]
[null,0,0,0,0,0]
[null,0,0,0,0,0]
[null,0,0,0,0,0]
[null,0,0,0,0,0]
[null,0,0,0,0,0]
[null,0,0,0,0,0]
[null,0,0,0,0,0]
[null,0,0,0,0,0]
[null,0,0,0,0,0]
[null,0,0,0,0,0]
[null,0,0,0,0,0]
[null,0,0,0,0,{"$f":"(C779-$N$11)*(C779-$N$11)","v":0}]
[null,0,0,{"$f":"B780*C780","v":0},{"$f":"(B780-$M$11)*(B780-$M$11)","v":0},0]
[null,0,0,0,0,0]
[null,0,0,0,0,0]
[null,0,0,0,0,0]
[null,0,0,0,0,0]
[null,0,0,0,0,0]
[null,0,0,0,0,0]
[null,0,0,0,0,0]
[null,0,0,0,0,0]
[null,0,0,0,0,0]
[null,0,0,0,0,0]
[null,0,0,0,0,0]
[null,0,0,0,0,0]
[null,0,0,0,0,0]
[null,0,0,0,0,0]
[null,0,0,0,0,0]
[null,0,0,0,0,0]
[null,0,0,0,0,0]
[null,0,0,0,0,0]
[null,0,0,0,0,0]
[null,0,0,0,0,0]
[null,0,0,0,0,0]
[null,0,0,0,0,0]
[null,0,0,0,0,0]
[null,0,0,0,0,0]
[null,0,0,0,0,0]
[null,0,0,0,0,0]
[null,0,0,0,0,0]
[null,0,0,0,0,0]
[null,0,0,0,0,0]
[null,0,0,0,0,0]
[null,0,0,0,0,0]
[null,0,0,0,0,0]
[null,0,0,0,0,0]
[null,0,0,0,0,0]
[null,0,0,0,0,0]
[null,0,0,0,0,0]
[null,0,0,0,0,0]
[null,0,0,0,0,0]
[null,0,0,0,0,0]
[null,0,0,0,0,0]
[null,0,0,0,0,0]
[null,0,0,0,0,0]
[null,0,0,0,0,0]
[null,0,0,0,0,0]
[null,0,0,0,0,0]
[null,0,0,0,0,0]
[null,0,0,0,0,0]
[null,0,0,0,0,0]
[null,0,0,0,0,0]
[null,0,0,0,0,0]
[null,0,0,0,0,0]
[null,0,0,0,0,0]
[null,0,0,0,0,0]
[null,0,0,0,0,0]
[null,0,0,0,0,0]
[null,0,0,0,0,0]
[null,0,0,0,0,0]
[null,0,0,0,0,0]
[null,0,0,0,0,0]
[null,0,0,0,0,0]
[null,0,0,0,0,0]
[null,0,0,0,0,0]
[null,0,0,0,0,{"$f":"(C843-$N$11)*(C843-$N$11)","v":0}]
[null,0,0,{"$f":"B844*C844","v":0},{"$f":"(B844-$M$11)*(B844-$M$11)","v":0},0]
[null,0,0,0,0,0]
[null,0,0,0,0,0]
[null,0,0,0,0,0]
[null,0,0,0,0,0]
[null,0,0,0,0,0]
[null,0,0,0,0,0]
[null,0,0,0,0,0]
[null,0,0,0,0,0]
[null,0,0,0,0,0]
[null,0,0,0,0,0]
[null,0,0,0,0,0]
[null,0,0,0,0,0]
[null,0,0,0,0,0]
[null,0,0,0,0,0]
[null,0,0,0,0,0]
[null,0,0,0,0,0]
[null,0,0,0,0,0]
[null,0,0,0,0,0]
[null,0,0,0,0,0]
[null,0,0,0,0,0]
[null,0,0,0,0,0]
[null,0,0,0,0,0]
[null,0,0,0,0,0]
[null,0,0,0,0,0]
[null,0,0,0,0,0]
[null,0,0,0,0,0]
[null,0,0,0,0,0]
[null,0,0,0,0,0]
[null,0,0,0,0,0]
[null,0,0,0,0,0]
[null,0,0,0,0,0]
[null,0,0,0,0,0]
[null,0,0,0,0,0]
[null,0,0,0,0,0]
[null,0,0,0,0,0]
[null,0,0,0,0,0]
[null,0,0,0,0,0]
[null,0,0,0,0,0]
[null,0,0,0,0,0]
[null,0,0,0,0,0]
[null,0,0,0,0,0]
[null,0,0,0,0,0]
[null,0,0,0,0,0]
[null,0,0,0,0,0]
[null,0,0,0,0,0]
[null,0,0,0,0,0]
[null,0,0,0,0,0]
[null,0,0,0,0,0]
[null,0,0,0,0,0]
[null,0,0,0,0,0]
[null,0,0,0,0,0]
[null,0,0,0,0,0]
[null,0,0,0,0,0]
[null,0,0,0,0,0]
[null,0,0,0,0,0]
[null,0,0,0,0,0]
[null,0,0,0,0,0]
[null,0,0,0,0,0]
[null,0,0,0,0,0]
[null,0,0,0,0,0]
[null,0,0,0,0,0]
[null,0,0,0,0,0]
[null,0,0,0,0,{"$f":"(C907-$N$11)*(C907-$N$11)","v":0}]
[null,0,0,{"$f":"B908*C908","v":0},{"$f":"(B908-$M$11)*(B908-$M$11)","v":0},0]
[null,0,0,0,0,0]
[null,0,0,0,0,0]
[null,0,0,0,0,0]
[null,0,0,0,0,0]
[null,0,0,0,0,0]
[null,0,0,0,0,0]
[null,0,0,0,0,0]
[null,0,0,0,0,0]
[null,0,0,0,0,0]
[null,0,0,0,0,0]
[null,0,0,0,0,0]
[null,0,0,0,0,0]
[null,0,0,0,0,0]
[null,0,0,0,0,0]
[null,0,0,0,0,0]
[null,0,0,0,0,0]
[null,0,0,0,0,0]
[null,0,0,0,0,0]
[null,0,0,0,0,0]
[null,0,0,0,0,0]
[null,0,0,0,0,0]
[null,0,0,0,0,0]
[null,0,0,0,0,0]
[null,0,0,0,0,0]
[null,0,0,0,0,0]
[null,0,0,0,0,0]
[null,0,0,0,0,0]
[null,0,0,0,0,0]
[null,0,0,0,0,0]
[null,0,0,0,0,0]
[null,0,0,0,0,0]
[null,0,0,0,0,0]
[null,0,0,0,0,0]
[null,0,0,0,0,0]
[null,0,0,0,0,0]
[null,0,0,0,0,0]
[null,0,0,0,0,0]
[null,0,0,0,0,0]
[null,0,0,0,0,0]
[null,0,0,0,0,0]
[null,0,0,0,0,0]
[null,0,0,0,0,0]
[null,0,0,0,0,0]
[null,0,0,0,0,0]
[null,0,0,0,0,0]
[null,0,0,0,0,0]
[null,0,0,0,0,0]
[null,0,0,0,0,0]
[null,0,0,0,0,0]
[null,0,0,0,0,0]
[null,0,0,0,0,0]
[null,0,0,0,0,0]
[null,0,0,0,0,0]
[null,0,0,0,0,0]
[null,0,0,0,0,0]
[null,0,0,0,0,0]
[null,0,0,0,0,0]
[null,0,0,0,0,0]
[null,0,0,0,0,0]
[null,0,0,0,0,0]
[null,0,0,0,0,0]
[null,0,0,0,0,0]
[null,0,0,0,0,{"$f":"(C971-$N$11)*(C971-$N$11)","v":0}]
[null,0,0,{"$f":"B972*C972","v":0},{"$f":"(B972-$M$11)*(B972-$M$11)","v":0},0]
[null,0,0,0,0,0]
[null,0,0,0,0,0]
[null,0,0,0,0,0]
[null,0,0,0,0,0]
[null,0,0,0,0,0]
[null,0,0,0,0,0]
[null,0,0,0,0,0]
[null,0,0,0,0,0]
[null,0,0,0,0,0]
[null,0,0,0,0,0]
[null,0,0,0,0,0]
[null,0,0,0,0,0]
[null,0,0,0,0,0]
[null,0,0,0,0,0]
[null,0,0,0,0,0]
[null,0,0,0,0,0]
[null,0,0,0,0,0]
[null,0,0,0,0,0]
[null,0,0,0,0,0]
[null,0,0,0,0,0]
[null,0,0,0,0,0]
[null,0,0,0,0,0]
[null,0,0,0,0,0]
[null,0,0,0,0,0]
[null,0,0,0,0,0]
[null,0,0,0,0,0]
[null,0,0,0,0,0]
[null,0,0,0,0,0]
[null,0,0,0,0,0]
[null,0,0,0,0,0]
[null,0,0,0,0,0]
[null,0,0,0,0,0]
[null,0,0,0,0,0]
[null,0,0,0,0,0]
[null,0,0,0,0,0]
[null,0,0,0,0,0]
[null,0,0,0,0,0]
[null,0,0,0,0,0]
[null,0,0,0,0,0]
[null,0,0,0,0,0]
[null,0,0,0,0,0]
[null,0,0,0,0,0]
[null,0,0,0,0,0]
[null,0,0,0,0,0]
[null,0,0,0,0,0]
[null,0,0,0,0,0]
[null,0,0,0,0,0]
[null,0,0,0,0,0]
[null,0,0,0,0,0]
[null,0,0,0,0,0]
[null,0,0,0,0,0]
[null,0,0,0,0,0]
[null,0,0,0,0,0]
[null,0,0,0,0,0]
[null,0,0,0,0,0]
[null,0,0,0,0,0]
[null,0,0,0,0,0]
[null,0,0,0,0,0]
[null,0,0,0,0,0]
[null,0,0,0,0,0]
[null,0,0,0,0,0]
[null,0,0,0,0,0]
[null,0,0,0,0,{"$f":"(C1035-$N$11)*(C1035-$N$11)","v":0}]
[null,0,0,{"$f":"B1036*C1036","v":0},{"$f":"(B1036-$M$11)*(B1036-$M$11)","v":0},0]
[null,0,0,0,0,0]
[null,0,0,0,0,0]
[null,0,0,0,0,0]
[null,0,0,0,0,0]
[null,0,0,0,0,0]
[null,0,0,0,0,0]
[null,0,0,0,0,0]
[null,0,0,0,0,0]
[null,0,0,0,0,0]
[null,0,0,0,0,0]
[null,0,0,0,0,0]
[null,0,0,0,0,0]
[null,0,0,0,0,0]
[null,0,0,0,0,0]
[null,0,0,0,0,0]
[null,0,0,0,0,0]
[null,0,0,0,0,0]
[null,0,0,0,0,0]
[null,0,0,0,0,0]
[null,0,0,0,0,0]
[null,0,0,0,0,0]
[null,0,0,0,0,0]
[null,0,0,0,0,0]
[null,0,0,0,0,0]
[null,0,0,0,0,0]
[null,0,0,0,0,0]
[null,0,0,0,0,0]
[null,0,0,0,0,0]
[null,0,0,0,0,0]
[null,0,0,0,0,0]
[null,0,0,0,0,0]
[null,0,0,0,0,0]
[null,0,0,0,0,0]
[null,0,0,0,0,0]
[null,0,0,0,0,0]
[null,0,0,0,0,0]
[null,0,0,0,0,0]
[null,0,0,0,0,0]
[null,0,0,0,0,0]
[null,0,0,0,0,0]
[null,0,0,0,0,0]
[null,0,0,0,0,0]
[null,0,0,0,0,0]
[null,0,0,0,0,0]
[null,0,0,0,0,0]
[null,0,0,0,0,0]
[null,0,0,0,0,0]
[null,0,0,0,0,0]
[null,0,0,0,0,0]
[null,0,0,0,0,0]
[null,0,0,0,0,0]
[null,0,0,0,0,0]
[null,0,0,0,0,0]
[null,0,0,0,0,0]
[null,0,0,0,0,0]
[null,0,0,0,0,0]
[null,0,0,0,0,0]
[null,0,0,0,0,0]
[null,0,0,0,0,0]
[null,0,0,0,0,0]
[null,0,0,0,0,0]
[null,0,0,0,0,0]
[null,0,0,0,0,{"$f":"(C1099-$N$11)*(C1099-$N$11)","v":0}]
[null,0,0,{"$f":"B1100*C1100","v":0},{"$f":"(B1100-$M$11)*(B1100-$M$11)","v":0},0]
[null,0,0,0,0,0]
[null,0,0,0,0,0]
[null,0,0,0,0,0]
[null,0,0,0,0,0]
[null,0,0,0,0,0]
[null,0,0,0,0,0]
[null,0,0,0,0,0]
[null,0,0,0,0,0]
[null,0,0,0,0,0]
[null,0,0,0,0,0]
[null,0,0,0,0,0]
[null,0,0,0,0,0]
[null,0,0,0,0,0]
[null,0,0,0,0,0]
[null,0,0,0,0,0]
[null,0,0,0,0,0]
[null,0,0,0,0,0]
[null,0,0,0,0,0]
[null,0,0,0,0,0]
[null,0,0,0,0,0]
[null,0,0,0,0,0]
[null,0,0,0,0,0]
[null,0,0,0,0,0]
[null,0,0,0,0,0]
[null,0,0,0,0,0]
[null,0,0,0,0,0]
[null,0,0,0,0,0]
[null,0,0,0,0,0]
[null,0,0,0,0,0]
[null,0,0,0,0,0]
[null,0,0,0,0,0]
[null,0,0,0,0,0]
[null,0,0,0,0,0]
[null,0,0,0,0,0]
[null,0,0,0,0,0]
[null,0,0,0,0,0]
[null,0,0,0,0,0]
[null,0,0,0,0,0]
[null,0,0,0,0,0]
[null,0,0,0,0,0]
[null,0,0,0,0,0]
[null,0,0,0,0,0]
[null,0,0,0,0,0]
[null,0,0,0,0,0]
[null,0,0,0,0,0]
[null,0,0,0,0,0]
[null,0,0,0,0,0]
[null,0,0,0,0,0]
[null,0,0,0,0,0]
[null,0,0,0,0,0]
[null,0,0,0,0,0]
[null,0,0,0,0,0]
[null,0,0,0,0,0]
[null,0,0,0,0,0]
[null,0,0,0,0,0]
[null,0,0,0,0,0]
[null,0,0,0,0,0]
[null,0,0,0,0,0]
[null,0,0,0,0,0]
[null,0,0,0,0,0]
[null,0,0,0,0,0]
[null,0,0,0,0,0]
[null,0,0,0,0,{"$f":"(C1163-$N$11)*(C1163-$N$11)","v":0}]
[null,0,0,{"$f":"B1164*C1164","v":0},{"$f":"(B1164-$M$11)*(B1164-$M$11)","v":0},0]
[null,0,0,0,0,0]
[null,0,0,0,0,0]
[null,0,0,0,0,0]
[null,0,0,0,0,0]
[null,0,0,0,0,0]
[null,0,0,0,0,0]
[null,0,0,0,0,0]
[null,0,0,0,0,0]
[null,0,0,0,0,0]
[null,0,0,0,0,0]
[null,0,0,0,0,0]
[null,0,0,0,0,0]
[null,0,0,0,0,0]
[null,0,0,0,0,0]
[null,0,0,0,0,0]
[null,0,0,0,0,0]
[null,0,0,0,0,0]
[null,0,0,0,0,0]
[null,0,0,0,0,0]
[null,0,0,0,0,0]
[null,0,0,0,0,0]
[null,0,0,0,0,0]
[null,0,0,0,0,0]
[null,0,0,0,0,0]
[null,0,0,0,0,0]
[null,0,0,0,0,0]
[null,0,0,0,0,0]
[null,0,0,0,0,0]
[null,0,0,0,0,0]
[null,0,0,0,0,0]
[null,0,0,0,0,0]
[null,0,0,0,0,0]
[null,0,0,0,0,0]
[null,0,0,0,0,0]
[null,0,0,0,0,0]
[null,0,0,0,0,0]
[null,0,0,0,0,0]
[null,0,0,0,0,0]
[null,0,0,0,0,0]
[null,0,0,0,0,0]
[null,0,0,0,0,0]
[null,0,0,0,0,0]
[null,0,0,0,0,0]
[null,0,0,0,0,0]
[null,0,0,0,0,0]
[null,0,0,0,0,0]
[null,0,0,0,0,0]
[null,0,0,0,0,0]
[null,0,0,0,0,0]
[null,0,0,0,0,0]
[null,0,0,0,0,0]
[null,0,0,0,0,0]
[null,0,0,0,0,0]
[null,0,0,0,0,0]
[null,0,0,0,0,0]
[null,0,0,0,0,0]
[null,0,0,0,0,0]
[null,0,0,0,0,0]
[null,0,0,0,0,0]
[null,0,0,0,0,0]
[null,0,0,0,0,0]
[null,0,0,0,0,0]
[null,0,0,0,0,{"$f":"(C1227-$N$11)*(C1227-$N$11)","v":0}]
[null,0,0,{"$f":"B1228*C1228","v":0},{"$f":"(B1228-$M$11)*(B1228-$M$11)","v":0},0]
[null,0,0,0,0,0]
[null,0,0,0,0,0]
[null,0,0,0,0,0]
[null,0,0,0,0,0]
[null,0,0,0,0,0]
[null,0,0,0,0,0]
[null,0,0,0,0,0]
[null,0,0,0,0,0]
[null,0,0,0,0,0]
[null,0,0,0,0,0]
[null,0,0,0,0,0]
[null,0,0,0,0,0]
[null,0,0,0,0,0]
[null,0,0,0,0,0]
[null,0,0,0,0,0]
[null,0,0,0,0,0]
[null,0,0,0,0,0]
[null,0,0,0,0,0]
[null,0,0,0,0,0]
[null,0,0,0,0,0]
[null,0,0,0,0,0]
[null,0,0,0,0,0]
[null,0,0,0,0,0]
[null,0,0,0,0,0]
[null,0,0,0,0,0]
[null,0,0,0,0,0]
[null,0,0,0,0,0]
[null,0,0,0,0,0]
[null,0,0,0,0,0]
[null,0,0,0,0,0]
[null,0,0,0,0,0]
[null,0,0,0,0,0]
[null,0,0,0,0,0]
[null,0,0,0,0,0]
[null,0,0,0,0,0]
[null,0,0,0,0,0]
[null,0,0,0,0,0]
[null,0,0,0,0,0]
[null,0,0,0,0,0]
[null,0,0,0,0,0]
[null,0,0,0,0,0]
[null,0,0,0,0,0]
[null,0,0,0,0,0]
[null,0,0,0,0,0]
[null,0,0,0,0,0]
[null,0,0,0,0,0]
[null,0,0,0,0,0]
[null,0,0,0,0,0]
[null,0,0,0,0,0]
[null,0,0,0,0,0]
[null,0,0,0,0,0]
[null,0,0,0,0,0]
[null,0,0,0,0,0]
[null,0,0,0,0,0]
[null,0,0,0,0,0]
[null,0,0,0,0,0]
[null,0,0,0,0,0]
[null,0,0,0,0,0]
[null,0,0,0,0,0]
[null,0,0,0,0,0]
[null,0,0,0,0,0]
[null,0,0,0,0,0]
[null,0,0,0,0,{"$f":"(C1291-$N$11)*(C1291-$N$11)","v":0}]
[null,0,0,{"$f":"B1292*C1292","v":0},{"$f":"(B1292-$M$11)*(B1292-$M$11)","v":0},0]
[null,0,0,0,0,0]
[null,0,0,0,0,0]
[null,0,0,0,0,0]
[null,0,0,0,0,0]
[null,0,0,0,0,0]
[null,0,0,0,0,0]
[null,0,0,0,0,0]
[null,0,0,0,0,0]
[null,0,0,0,0,0]
[null,0,0,0,0,0]
[null,0,0,0,0,0]
[null,0,0,0,0,0]
[null,0,0,0,0,0]
[null,0,0,0,0,0]
[null,0,0,0,0,0]
[null,0,0,0,0,0]
[null,0,0,0,0,0]
[null,0,0,0,0,0]
[null,0,0,0,0,0]
[null,0,0,0,0,0]
[null,0,0,0,0,0]
[null,0,0,0,0,0]
[null,0,0,0,0,0]
[null,0,0,0,0,0]
[null,0,0,0,0,0]
[null,0,0,0,0,0]
[null,0,0,0,0,0]
[null,0,0,0,0,0]
[null,0,0,0,0,0]
[null,0,0,0,0,0]
[null,0,0,0,0,0]
[null,0,0,0,0,0]
[null,0,0,0,0,0]
[null,0,0,0,0,0]
[null,0,0,0,0,0]
[null,0,0,0,0,0]
[null,0,0,0,0,0]
[null,0,0,0,0,0]
[null,0,0,0,0,0]
[null,0,0,0,0,0]
[null,0,0,0,0,0]
[null,0,0,0,0,0]
[null,0,0,0,0,0]
[null,0,0,0,0,0]
[null,0,0,0,0,0]
[null,0,0,0,0,0]
[null,0,0,0,0,0]
[null,0,0,0,0,0]
[null,0,0,0,0,0]
[null,0,0,0,0,0]
[null,0,0,0,0,0]
[null,0,0,0,0,0]
[null,0,0,0,0,0]
[null,0,0,0,0,0]
[null,0,0,0,0,0]
[null,0,0,0,0,0]
[null,0,0,0,0,0]
[null,0,0,0,0,0]
[null,0,0,0,0,0]
[null,0,0,0,0,0]
[null,0,0,0,0,0]
[null,0,0,0,0,0]
[null,0,0,0,0,{"$f":"(C1355-$N$11)*(C1355-$N$11)","v":0}]
[null,0,0,{"$f":"B1356*C1356","v":0},{"$f":"(B1356-$M$11)*(B1356-$M$11)","v":0},0]
[null,0,0,0,0,0]
[null,0,0,0,0,0]
[null,0,0,0,0,0]
[null,0,0,0,0,0]
[null,0,0,0,0,0]
[null,0,0,0,0,0]
[null,0,0,0,0,0]
[null,0,0,0,0,0]
[null,0,0,0,0,0]
[null,0,0,0,0,0]
[null,0,0,0,0,0]
[null,0,0,0,0,0]
[null,0,0,0,0,0]
[null,0,0,0,0,0]
[null,0,0,0,0,0]
[null,0,0,0,0,0]
[null,0,0,0,0,0]
[null,0,0,0,0,0]
[null,0,0,0,0,0]
[null,0,0,0,0,0]
[null,0,0,0,0,0]
[null,0,0,0,0,0]
[null,0,0,0,0,0]
[null,0,0,0,0,0]
[null,0,0,0,0,0]
[null,0,0,0,0,0]
[null,0,0,0,0,0]
[null,0,0,0,0,0]
[null,0,0,0,0,0]
[null,0,0,0,0,0]
[null,0,0,0,0,0]
[null,0,0,0,0,0]
[null,0,0,0,0,0]
[null,0,0,0,0,0]
[null,0,0,0,0,0]
[null,0,0,0,0,0]
[null,0,0,0,0,0]
[null,0,0,0,0,0]
[null,0,0,0,0,0]
[null,0,0,0,0,0]
[null,0,0,0,0,0]
[null,0,0,0,0,0]
[null,0,0,0,0,0]
[null,0,0,0,0,0]
[null,0,0,0,0,0]
[null,0,0,0,0,0]
[null,0,0,0,0,0]
[null,0,0,0,0,0]
[null,0,0,0,0,0]
[null,0,0,0,0,0]
[null,0,0,0,0,0]
[null,0,0,0,0,0]
[null,0,0,0,0,0]
[null,0,0,0,0,0]
[null,0,0,0,0,0]
[null,0,0,0,0,0]
[null,0,0,0,0,0]
[null,0,0,0,0,0]
[null,0,0,0,0,0]
[null,0,0,0,0,0]
[null,0,0,0,0,0]
[null,0,0,0,0,0]
[null,0,0,0,0,{"$f":"(C1419-$N$11)*(C1419-$N$11)","v":0}]
[null,0,0,{"$f":"B1420*C1420","v":0},{"$f":"(B1420-$M$11)*(B1420-$M$11)","v":0},0]
[null,0,0,0,0,0]
[null,0,0,0,0,0]
[null,0,0,0,0,0]
[null,0,0,0,0,0]
[null,0,0,0,0,0]
[null,0,0,0,0,0]
[null,0,0,0,0,0]
[null,0,0,0,0,0]
[null,0,0,0,0,0]
[null,0,0,0,0,0]
[null,0,0,0,0,0]
[null,0,0,0,0,0]
[null,0,0,0,0,0]
[null,0,0,0,0,0]
[null,0,0,0,0,0]
[null,0,0,0,0,0]
[null,0,0,0,0,0]
[null,0,0,0,0,0]
[null,0,0,0,0,0]
[null,0,0,0,0,0]
[null,0,0,0,0,0]
[null,0,0,0,0,0]
[null,0,0,0,0,0]
[null,0,0,0,0,0]
[null,0,0,0,0,0]
[null,0,0,0,0,0]
[null,0,0,0,0,0]
[null,0,0,0,0,0]
[null,0,0,0,0,0]
[null,0,0,0,0,0]
[null,0,0,0,0,0]
[null,0,0,0,0,0]
[null,0,0,0,0,0]
[null,0,0,0,0,0]
[null,0,0,0,0,0]
[null,0,0,0,0,0]
[null,0,0,0,0,0]
[null,0,0,0,0,0]
[null,0,0,0,0,0]
[null,0,0,0,0,0]
[null,0,0,0,0,0]
[null,0,0,0,0,0]
[null,0,0,0,0,0]
[null,0,0,0,0,0]
[null,0,0,0,0,0]
[null,0,0,0,0,0]
[null,0,0,0,0,0]
[null,0,0,0,0,0]
[null,0,0,0,0,0]
[null,0,0,0,0,0]
[null,0,0,0,0,0]
[null,0,0,0,0,0]
[null,0,0,0,0,0]
[null,0,0,0,0,0]
[null,0,0,0,0,0]
[null,0,0,0,0,0]
[null,0,0,0,0,0]
[null,0,0,0,0,0]
[null,0,0,0,0,0]
[null,0,0,0,0,0]
[null,0,0,0,0,0]
[null,0,0,0,0,0]
[null,0,0,0,0,{"$f":"(C1483-$N$11)*(C1483-$N$11)","v":0}]
[null,0,0,{"$f":"B1484*C1484","v":0},{"$f":"(B1484-$M$11)*(B1484-$M$11)","v":0},0]
[null,0,0,0,0,0]
[null,0,0,0,0,0]
[null,0,0,0,0,0]
[null,0,0,0,0,0]
[null,0,0,0,0,0]
[null,0,0,0,0,0]
[null,0,0,0,0,0]
[null,0,0,0,0,0]
[null,0,0,0,0,0]
[null,0,0,0,0,0]
[null,0,0,0,0,0]
[null,0,0,0,0,0]
[null,0,0,0,0,0]
[null,0,0,0,0,0]
[null,0,0,0,0,0]
[null,0,0,0,0,0]
[null,0,0,0,0,0]
[null,0,0,0,0,0]
[null,0,0,0,0,0]
[null,0,0,0,0,0]
[null,0,0,0,0,0]
[null,0,0,0,0,0]
[null,0,0,0,0,0]
[null,0,0,0,0,0]
[null,0,0,0,0,0]
[null,0,0,0,0,0]
[null,0,0,0,0,0]
[null,0,0,0,0,0]
[null,0,0,0,0,0]
[null,0,0,0,0,0]
[null,0,0,0,0,0]
[null,0,0,0,0,0]
[null,0,0,0,0,0]
[null,0,0,0,0,0]
[null,0,0,0,0,0]
[null,0,0,0,0,0]
[null,0,0,0,0,0]
[null,0,0,0,0,0]
[null,0,0,0,0,0]
[null,0,0,0,0,0]
[null,0,0,0,0,0]
[null,0,0,0,0,0]
[null,0,0,0,0,0]
[null,0,0,0,0,0]
[null,0,0,0,0,0]
[null,0,0,0,0,0]
[null,0,0,0,0,0]
[null,0,0,0,0,0]
[null,0,0,0,0,0]
[null,0,0,0,0,0]
[null,0,0,0,0,0]
[null,0,0,0,0,0]
[null,0,0,0,0,0]
[null,0,0,0,0,0]
[null,0,0,0,0,0]
[null,0,0,0,0,0]
[null,0,0,0,0,0]
[null,0,0,0,0,0]
[null,0,0,0,0,0]
[null,0,0,0,0,0]
[null,0,0,0,0,0]
[null,0,0,0,0,0]
[null,0,0,0,0,{"$f":"(C1547-$N$11)*(C1547-$N$11)","v":0}]
[null,0,0,{"$f":"B1548*C1548","v":0},{"$f":"(B1548-$M$11)*(B1548-$M$11)","v":0},0]
[null,0,0,0,0,0]
[null,0,0,0,0,0]
[null,0,0,0,0,0]
[null,0,0,0,0,0]
[null,0,0,0,0,0]
[null,0,0,0,0,0]
[null,0,0,0,0,0]
[null,0,0,0,0,0]
[null,0,0,0,0,0]
[null,0,0,0,0,0]
[null,0,0,0,0,0]
[null,0,0,0,0,0]
[null,0,0,0,0,0]
[null,0,0,0,0,0]
[null,0,0,0,0,0]
[null,0,0,0,0,0]
[null,0,0,0,0,0]
[null,0,0,0,0,0]
[null,0,0,0,0,0]
[null,0,0,0,0,0]
[null,0,0,0,0,0]
[null,0,0,0,0,0]
[null,0,0,0,0,0]
[null,0,0,0,0,0]
[null,0,0,0,0,0]
[null,0,0,0,0,0]
[null,0,0,0,0,0]
[null,0,0,0,0,0]
[null,0,0,0,0,0]
[null,0,0,0,0,0]
[null,0,0,0,0,0]
[null,0,0,0,0,0]
[null,0,0,0,0,0]
[null,0,0,0,0,0]
[null,0,0,0,0,0]
[null,0,0,0,0,0]
[null,0,0,0,0,0]
[null,0,0,0,0,0]
[null,0,0,0,0,0]
[null,0,0,0,0,0]
[null,0,0,0,0,0]
[null,0,0,0,0,0]
[null,0,0,0,0,0]
[null,0,0,0,0,0]
[null,0,0,0,0,0]
[null,0,0,0,0,0]
[null,0,0,0,0,0]
[null,0,0,0,0,0]
[null,0,0,0,0,0]
[null,0,0,0,0,0]
[null,0,0,0,0,0]
[null,0,0,0,0,0]
[null,0,0,0,0,0]
[null,0,0,0,0,0]
[null,0,0,0,0,0]
[null,0,0,0,0,0]
[null,0,0,0,0,0]
[null,0,0,0,0,0]
[null,0,0,0,0,0]
[null,0,0,0,0,0]
[null,0,0,0,0,0]
[null,0,0,0,0,0]
[null,0,0,0,0,{"$f":"(C1611-$N$11)*(C1611-$N$11)","v":0}]
[null,0,0,{"$f":"B1612*C1612","v":0},{"$f":"(B1612-$M$11)*(B1612-$M$11)","v":0},0]
[null,0,0,0,0,0]
[null,0,0,0,0,0]
[null,0,0,0,0,0]
[null,0,0,0,0,0]
[null,0,0,0,0,0]
[null,0,0,0,0,0]
[null,0,0,0,0,0]
[null,0,0,0,0,0]
[null,0,0,0,0,0]
[null,0,0,0,0,0]
[null,0,0,0,0,0]
[null,0,0,0,0,0]
[null,0,0,0,0,0]
[null,0,0,0,0,0]
[null,0,0,0,0,0]
[null,0,0,0,0,0]
[null,0,0,0,0,0]
[null,0,0,0,0,0]
[null,0,0,0,0,0]
[null,0,0,0,0,0]
[null,0,0,0,0,0]
[null,0,0,0,0,0]
[null,0,0,0,0,0]
[null,0,0,0,0,0]
[null,0,0,0,0,0]
[null,0,0,0,0,0]
[null,0,0,0,0,0]
[null,0,0,0,0,0]
[null,0,0,0,0,0]
[null,0,0,0,0,0]
[null,0,0,0,0,0]
[null,0,0,0,0,0]
[null,0,0,0,0,0]
[null,0,0,0,0,0]
[null,0,0,0,0,0]
[null,0,0,0,0,0]
[null,0,0,0,0,0]
[null,0,0,0,0,0]
[null,0,0,0,0,0]
[null,0,0,0,0,0]
[null,0,0,0,0,0]
[null,0,0,0,0,0]
[null,0,0,0,0,0]
[null,0,0,0,0,0]
[null,0,0,0,0,0]
[null,0,0,0,0,0]
[null,0,0,0,0,0]
[null,0,0,0,0,0]
[null,0,0,0,0,0]
[null,0,0,0,0,0]
[null,0,0,0,0,0]
[null,0,0,0,0,0]
[null,0,0,0,0,0]
[null,0,0,0,0,0]
[null,0,0,0,0,0]
[null,0,0,0,0,0]
[null,0,0,0,0,0]
[null,0,0,0,0,0]
[null,0,0,0,0,0]
[null,0,0,0,0,0]
[null,0,0,0,0,0]
[null,0,0,0,0,0]
[null,0,0,0,0,{"$f":"(C1675-$N$11)*(C1675-$N$11)","v":0}]
[null,0,0,{"$f":"B1676*C1676","v":0},{"$f":"(B1676-$M$11)*(B1676-$M$11)","v":0},0]
[null,0,0,0,0,0]
[null,0,0,0,0,0]
[null,0,0,0,0,0]
[null,0,0,0,0,0]
[null,0,0,0,0,0]
[null,0,0,0,0,0]
[null,0,0,0,0,0]
[null,0,0,0,0,0]
[null,0,0,0,0,0]
[null,0,0,0,0,0]
[null,0,0,0,0,0]
[null,0,0,0,0,0]
[null,0,0,0,0,0]
[null,0,0,0,0,0]
[null,0,0,0,0,0]
[null,0,0,0,0,0]
[null,0,0,0,0,0]
[null,0,0,0,0,0]
[null,0,0,0,0,0]
[null,0,0,0,0,0]
[null,0,0,0,0,0]
[null,0,0,0,0,0]
[null,0,0,0,0,0]
[null,0,0,0,0,0]
[null,0,0,0,0,0]
[null,0,0,0,0,0]
[null,0,0,0,0,0]
[null,0,0,0,0,0]
[null,0,0,0,0,0]
[null,0,0,0,0,0]
[null,0,0,0,0,0]
[null,0,0,0,0,0]
[null,0,0,0,0,0]
[null,0,0,0,0,0]
[null,0,0,0,0,0]
[null,0,0,0,0,0]
[null,0,0,0,0,0]
[null,0,0,0,0,0]
[null,0,0,0,0,0]
[null,0,0,0,0,0]
[null,0,0,0,0,0]
[null,0,0,0,0,0]
[null,0,0,0,0,0]
[null,0,0,0,0,0]
[null,0,0,0,0,0]
[null,0,0,0,0,0]
[null,0,0,0,0,0]
[null,0,0,0,0,0]
[null,0,0,0,0,0]
[null,0,0,0,0,0]
[null,0,0,0,0,0]
[null,0,0,0,0,0]
[null,0,0,0,0,0]
[null,0,0,0,0,0]
[null,0,0,0,0,0]
[null,0,0,0,0,0]
[null,0,0,0,0,0]
[null,0,0,0,0,0]
[null,0,0,0,0,0]
[null,0,0,0,0,0]
[null,0,0,0,0,0]
[null,0,0,0,0,0]
[null,0,0,0,0,{"$f":"(C1739-$N$11)*(C1739-$N$11)","v":0}]
[null,0,0,{"$f":"B1740*C1740","v":0},{"$f":"(B1740-$M$11)*(B1740-$M$11)","v":0},0]
[null,0,0,0,0,0]
[null,0,0,0,0,0]
[null,0,0,0,0,0]
[null,0,0,0,0,0]
[null,0,0,0,0,0]
[null,0,0,0,0,0]
[null,0,0,0,0,0]
[null,0,0,0,0,0]
[null,0,0,0,0,0]
[null,0,0,0,0,0]
[null,0,0,0,0,0]
[null,0,0,0,0,0]
[null,0,0,0,0,0]
[null,0,0,0,0,0]
[null,0,0,0,0,0]
[null,0,0,0,0,0]
[null,0,0,0,0,0]
[null,0,0,0,0,0]
[null,0,0,0,0,0]
[null,0,0,0,0,0]
[null,0,0,0,0,0]
[null,0,0,0,0,0]
[null,0,0,0,0,0]
[null,0,0,0,0,0]
[null,0,0,0,0,0]
[null,0,0,0,0,0]
[null,0,0,0,0,0]
[null,0,0,0,0,0]
[null,0,0,0,0,0]
[null,0,0,0,0,0]
[null,0,0,0,0,0]
[null,0,0,0,0,0]
[null,0,0,0,0,0]
[null,0,0,0,0,0]
[null,0,0,0,0,0]
[null,0,0,0,0,0]
[null,0,0,0,0,0]
[null,0,0,0,0,0]
[null,0,0,0,0,0]
[null,0,0,0,0,0]
[null,0,0,0,0,0]
[null,0,0,0,0,0]
[null,0,0,0,0,0]
[null,0,0,0,0,0]
[null,0,0,0,0,0]
[null,0,0,0,0,0]
[null,0,0,0,0,0]
[null,0,0,0,0,0]
[null,0,0,0,0,0]
[null,0,0,0,0,0]
[null,0,0,0,0,0]
[null,0,0,0,0,0]
[null,0,0,0,0,0]
[null,0,0,0,0,0]
[null,0,0,0,0,0]
[null,0,0,0,0,0]
[null,0,0,0,0,0]
[null,0,0,0,0,0]
[null,0,0,0,0,0]
[null,0,0,0,0,0]
[null,0,0,0,0,0]
[null,0,0,0,0,0]
[null,0,0,0,0,{"$f":"(C1803-$N$11)*(C1803-$N$11)","v":0}]
[null,0,0,{"$f":"B1804*C1804","v":0},{"$f":"(B1804-$M$11)*(B1804-$M$11)","v":0},0]
[null,0,0,0,0,0]
[null,0,0,0,0,0]
[null,0,0,0,0,0]
[null,0,0,0,0,0]
[null,0,0,0,0,0]
[null,0,0,0,0,0]
[null,0,0,0,0,0]
[null,0,0,0,0,0]
[null,0,0,0,0,0]
[null,0,0,0,0,0]
[null,0,0,0,0,0]
[null,0,0,0,0,0]
[null,0,0,0,0,0]
[null,0,0,0,0,0]
[null,0,0,0,0,0]
[null,0,0,0,0,0]
[null,0,0,0,0,0]
[null,0,0,0,0,0]
[null,0,0,0,0,0]
[null,0,0,0,0,0]
[null,0,0,0,0,0]
[null,0,0,0,0,0]
[null,0,0,0,0,0]
[null,0,0,0,0,0]
[null,0,0,0,0,0]
[null,0,0,0,0,0]
[null,0,0,0,0,0]
[null,0,0,0,0,0]
[null,0,0,0,0,0]
[null,0,0,0,0,0]
[null,0,0,0,0,0]
[null,0,0,0,0,0]
[null,0,0,0,0,0]
[null,0,0,0,0,0]
[null,0,0,0,0,0]
[null,0,0,0,0,0]
[null,0,0,0,0,0]
[null,0,0,0,0,0]
[null,0,0,0,0,0]
[null,0,0,0,0,0]
[null,0,0,0,0,0]
[null,0,0,0,0,0]
[null,0,0,0,0,0]
[null,0,0,0,0,0]
[null,0,0,0,0,0]
[null,0,0,0,0,0]
[null,0,0,0,0,0]
[null,0,0,0,0,0]
[null,0,0,0,0,0]
[null,0,0,0,0,0]
[null,0,0,0,0,0]
[null,0,0,0,0,0]
[null,0,0,0,0,0]
[null,0,0,0,0,0]
[null,0,0,0,0,0]
[null,0,0,0,0,0]
[null,0,0,0,0,0]
[null,0,0,0,0,0]
[null,0,0,0,0,0]
[null,0,0,0,0,0]
[null,0,0,0,0,0]
[null,0,0,0,0,0]
[null,0,0,0,0,{"$f":"(C1867-$N$11)*(C1867-$N$11)","v":0}]
[null,0,0,{"$f":"B1868*C1868","v":0},{"$f":"(B1868-$M$11)*(B1868-$M$11)","v":0},0]
[null,0,0,0,0,0]
[null,0,0,0,0,0]
[null,0,0,0,0,0]
[null,0,0,0,0,0]
[null,0,0,0,0,0]
[null,0,0,0,0,0]
[null,0,0,0,0,0]
[null,0,0,0,0,0]
[null,0,0,0,0,0]
[null,0,0,0,0,0]
[null,0,0,0,0,0]
[null,0,0,0,0,0]
[null,0,0,0,0,0]
[null,0,0,0,0,0]
[null,0,0,0,0,0]
[null,0,0,0,0,0]
[null,0,0,0,0,0]
[null,0,0,0,0,0]
[null,0,0,0,0,0]
[null,0,0,0,0,0]
[null,0,0,0,0,0]
[null,0,0,0,0,0]
[null,0,0,0,0,0]
[null,0,0,0,0,0]
[null,0,0,0,0,0]
[null,0,0,0,0,0]
[null,0,0,0,0,0]
[null,0,0,0,0,0]
[null,0,0,0,0,0]
[null,0,0,0,0,0]
[null,0,0,0,0,0]
[null,0,0,0,0,0]
[null,0,0,0,0,0]
[null,0,0,0,0,0]
[null,0,0,0,0,0]
[null,0,0,0,0,0]
[null,0,0,0,0,0]
[null,0,0,0,0,0]
[null,0,0,0,0,0]
[null,0,0,0,0,0]
[null,0,0,0,0,0]
[null,0,0,0,0,0]
[null,0,0,0,0,0]
[null,0,0,0,0,0]
[null,0,0,0,0,0]
[null,0,0,0,0,0]
[null,0,0,0,0,0]
[null,0,0,0,0,0]
[null,0,0,0,0,0]
[null,0,0,0,0,0]
[null,0,0,0,0,0]
[null,0,0,0,0,0]
[null,0,0,0,0,0]
[null,0,0,0,0,0]
[null,0,0,0,0,0]
[null,0,0,0,0,0]
[null,0,0,0,0,0]
[null,0,0,0,0,0]
[null,0,0,0,0,0]
[null,0,0,0,0,0]
[null,0,0,0,0,0]
[null,0,0,0,0,0]
[null,0,0,0,0,{"$f":"(C1931-$N$11)*(C1931-$N$11)","v":0}]
[null,0,0,{"$f":"B1932*C1932","v":0},{"$f":"(B1932-$M$11)*(B1932-$M$11)","v":0},0]
[null,0,0,0,0,0]
[null,0,0,0,0,0]
[null,0,0,0,0,0]
[null,0,0,0,0,0]
[null,0,0,0,0,0]
[null,0,0,0,0,0]
[null,0,0,0,0,0]
[null,0,0,0,0,0]
[null,0,0,0,0,0]
[null,0,0,0,0,0]
[null,0,0,0,0,0]
[null,0,0,0,0,0]
[null,0,0,0,0,0]
[null,0,0,0,0,0]
[null,0,0,0,0,0]
[null,0,0,0,0,0]
[null,0,0,0,0,0]
[null,0,0,0,0,0]
[null,0,0,0,0,0]
[null,0,0,0,0,0]
[null,0,0,0,0,0]
[null,0,0,0,0,0]
[null,0,0,0,0,0]
[null,0,0,0,0,0]
[null,0,0,0,0,0]
[null,0,0,0,0,0]
[null,0,0,0,0,0]
[null,0,0,0,0,0]
[null,0,0,0,0,0]
[null,0,0,0,0,0]
[null,0,0,0,0,0]
[null,0,0,0,0,0]
[null,0,0,0,0,0]
[null,0,0,0,0,0]
[null,0,0,0,0,0]
[null,0,0,0,0,0]
[null,0,0,0,0,0]
[null,0,0,0,0,0]
[null,0,0,0,0,0]
[null,0,0,0,0,0]
[null,0,0,0,0,0]
[null,0,0,0,0,0]
[null,0,0,0,0,0]
[null,0,0,0,0,0]
[null,0,0,0,0,0]
[null,0,0,0,0,0]
[null,0,0,0,0,0]
[null,0,0,0,0,0]
[null,0,0,0,0,0]
[null,0,0,0,0,0]
[null,0,0,0,0,0]
[null,0,0,0,0,0]
[null,0,0,0,0,0]
[null,0,0,0,0,0]
[null,0,0,0,0,0]
[null,0,0,0,0,0]
[null,0,0,0,0,0]
[null,0,0,0,0,0]
[null,0,0,0,0,0]
[null,0,0,0,0,0]
[null,0,0,0,0,0]
[null,0,0,0,0,0]
[null,0,0,0,0,{"$f":"(C1995-$N$11)*(C1995-$N$11)","v":0}]
[null,0,0,{"$f":"B1996*C1996","v":0},{"$f":"(B1996-$M$11)*(B1996-$M$11)","v":0},0]
[null,0,0,0,0,0]
[null,0,0,0,0,0]
[null,0,0,0,0,0]
[null,0,0,0,0,0]
[null,0,0,0,0,0]
[null,0,0,0,0,0]
[null,0,0,0,0,0]
[null,0,0,0,0,0]
[null,0,0,0,0,0]
[null,0,0,0,0,0]
[null,0,0,0,0,0]
[null,0,0,0,0,0]
[null,0,0,0,0,0]
[null,0,0,0,0,0]
[null,0,0,0,0,0]
[null,0,0,0,0,0]
[null,0,0,0,0,0]
[null,0,0,0,0,0]
[null,0,0,0,0,0]
[null,0,0,0,0,0]
[null,0,0,0,0,0]
[null,0,0,0,0,0]
[null,0,0,0,0,0]
[null,0,0,0,0,0]
[null,0,0,0,0,0]
[null,0,0,0,0,0]
[null,0,0,0,0,0]
[null,0,0,0,0,0]
[null,0,0,0,0,0]
[null,0,0,0,0,0]
[null,0,0,0,0,0]
[null,0,0,0,0,0]
[null,0,0,0,0,0]
[null,0,0,0,0,0]
[null,0,0,0,0,0]
[null,0,0,0,0,0]
[null,0,0,0,0,0]
[null,0,0,0,0,0]
[null,0,0,0,0,0]
[null,0,0,0,0,0]
[null,0,0,0,0,0]
[null,0,0,0,0,0]
[null,0,0,0,0,0]
[null,0,0,0,0,0]
[null,0,0,0,0,0]
[null,0,0,0,0,0]
[null,0,0,0,0,0]
[null,0,0,0,0,0]
[null,0,0,0,0,0]
[null,0,0,0,0,0]
[null,0,0,0,0,0]
[null,0,0,0,0,0]
[null,0,0,0,0,0]
[null,0,0,0,0,0]
[null,0,0,0,0,0]
[null,0,0,0,0,0]
[null,0,0,0,0,0]
[null,0,0,0,0,0]
[null,0,0,0,0,0]
[null,0,0,0,0,0]
[null,0,0,0,0,0]
[null,0,0,0,0,0]
[null,0,0,0,0,{"$f":"(C2059-$N$11)*(C2059-$N$11)","v":0}]
[null,0,0,{"$f":"B2060*C2060","v":0},{"$f":"(B2060-$M$11)*(B2060-$M$11)","v":0},0]
[null,0,0,0,0,0]
[null,0,0,0,0,0]
[null,0,0,0,0,0]
[null,0,0,0,0,0]
[null,0,0,0,0,0]
[null,0,0,0,0,0]
[null,0,0,0,0,0]
[null,0,0,0,0,0]
[null,0,0,0,0,0]
[null,0,0,0,0,0]
[null,0,0,0,0,0]
[null,0,0,0,0,0]
[null,0,0,0,0,0]
[null,0,0,0,0,0]
[null,0,0,0,0,0]
[null,0,0,0,0,0]
[null,0,0,0,0,0]
[null,0,0,0,0,0]
[null,0,0,0,0,0]
[null,0,0,0,0,0]
[null,0,0,0,0,0]
[null,0,0,0,0,0]
[null,0,0,0,0,0]
[null,0,0,0,0,0]
[null,0,0,0,0,0]
[null,0,0,0,0,0]
[null,0,0,0,0,0]
[null,0,0,0,0,0]
[null,0,0,0,0,0]
[null,0,0,0,0,0]
[null,0,0,0,0,0]
[null,0,0,0,0,0]
[null,0,0,0,0,0]
[null,0,0,0,0,0]
[null,0,0,0,0,0]
[null,0,0,0,0,0]
[null,0,0,0,0,0]
[null,0,0,0,0,0]
[null,0,0,0,0,0]
[null,0,0,0,0,0]
[null,0,0,0,0,0]
[null,0,0,0,0,0]
[null,0,0,0,0,0]
[null,0,0,0,0,0]
[null,0,0,0,0,0]
[null,0,0,0,0,0]
[null,0,0,0,0,0]
[null,0,0,0,0,0]
[null,0,0,0,0,0]
[null,0,0,0,0,0]
[null,0,0,0,0,0]
[null,0,0,0,0,0]
[null,0,0,0,0,0]
[null,0,0,0,0,0]
[null,0,0,0,0,0]
[null,0,0,0,0,0]
[null,0,0,0,0,0]
[null,0,0,0,0,0]
[null,0,0,0,0,0]
[null,0,0,0,0,0]
[null,0,0,0,0,0]
[null,0,0,0,0,0]
[null,0,0,0,0,{"$f":"(C2123-$N$11)*(C2123-$N$11)","v":0}]
[null,0,0,{"$f":"B2124*C2124","v":0},{"$f":"(B2124-$M$11)*(B2124-$M$11)","v":0},0]
[null,0,0,0,0,0]
[null,0,0,0,0,0]
[null,0,0,0,0,0]
[null,0,0,0,0,0]
[null,0,0,0,0,0]
[null,0,0,0,0,0]
[null,0,0,0,0,0]
[null,0,0,0,0,0]
[null,0,0,0,0,0]
[null,0,0,0,0,0]
[null,0,0,0,0,0]
[null,0,0,0,0,0]
[null,0,0,0,0,0]
[null,0,0,0,0,0]
[null,0,0,0,0,0]
[null,0,0,0,0,0]
[null,0,0,0,0,0]
[null,0,0,0,0,0]
[null,0,0,0,0,0]
[null,0,0,0,0,0]
[null,0,0,0,0,0]
[null,0,0,0,0,0]
[null,0,0,0,0,0]
[null,0,0,0,0,0]
[null,0,0,0,0,0]
[null,0,0,0,0,0]
[null,0,0,0,0,0]
[null,0,0,0,0,0]
[null,0,0,0,0,0]
[null,0,0,0,0,0]
[null,0,0,0,0,0]
[null,0,0,0,0,0]
[null,0,0,0,0,0]
[null,0,0,0,0,0]
[null,0,0,0,0,0]
[null,0,0,0,0,0]
[null,0,0,0,0,0]
[null,0,0,0,0,0]
[null,0,0,0,0,0]
[null,0,0,0,0,0]
[null,0,0,0,0,0]
[null,0,0,0,0,0]
[null,0,0,0,0,0]
[null,0,0,0,0,0]
[null,0,0,0,0,0]
[null,0,0,0,0,0]
[null,0,0,0,0,0]
[null,0,0,0,0,0]
[null,0,0,0,0,0]
[null,0,0,0,0,0]
[null,0,0,0,0,0]
[null,0,0,0,0,0]
[null,0,0,0,0,0]
[null,0,0,0,0,0]
[null,0,0,0,0,0]
[null,0,0,0,0,0]
[null,0,0,0,0,0]
[null,0,0,0,0,0]
[null,0,0,0,0,0]
[null,0,0,0,0,0]
[null,0,0,0,0,0]
[null,0,0,0,0,0]
[null,0,0,0,0,{"$f":"(C2187-$N$11)*(C2187-$N$11)","v":0}]
[null,0,0,{"$f":"B2188*C2188","v":0},{"$f":"(B2188-$M$11)*(B2188-$M$11)","v":0},0]
[null,0,0,0,0,0]
[null,0,0,0,0,0]
[null,0,0,0,0,0]
[null,0,0,0,0,0]
[null,0,0,0,0,0]
[null,0,0,0,0,0]
[null,0,0,0,0,0]
[null,0,0,0,0,0]
[null,0,0,0,0,0]
[null,0,0,0,0,0]
[null,0,0,0,0,0]
[null,0,0,0,0,0]
[null,0,0,0,0,0]
[null,0,0,0,0,0]
[null,0,0,0,0,0]
[null,0,0,0,0,0]
[null,0,0,0,0,0]
[null,0,0,0,0,0]
[null,0,0,0,0,0]
[null,0,0,0,0,0]
[null,0,0,0,0,0]
[null,0,0,0,0,0]
[null,0,0,0,0,0]
[null,0,0,0,0,0]
[null,0,0,0,0,0]
[null,0,0,0,0,0]
[null,0,0,0,0,0]
[null,0,0,0,0,0]
[null,0,0,0,0,0]
[null,0,0,0,0,0]
[null,0,0,0,0,0]
[null,0,0,0,0,0]
[null,0,0,0,0,0]
[null,0,0,0,0,0]
[null,0,0,0,0,0]
[null,0,0,0,0,0]
[null,0,0,0,0,0]
[null,0,0,0,0,0]
[null,0,0,0,0,0]
[null,0,0,0,0,0]
[null,0,0,0,0,0]
[null,0,0,0,0,0]
[null,0,0,0,0,0]
[null,0,0,0,0,0]
[null,0,0,0,0,0]
[null,0,0,0,0,0]
[null,0,0,0,0,0]
[null,0,0,0,0,0]
[null,0,0,0,0,0]
[null,0,0,0,0,0]
[null,0,0,0,0,0]
[null,0,0,0,0,0]
[null,0,0,0,0,0]
[null,0,0,0,0,0]
[null,0,0,0,0,0]
[null,0,0,0,0,0]
[null,0,0,0,0,0]
[null,0,0,0,0,0]
[null,0,0,0,0,0]
[null,0,0,0,0,0]
[null,0,0,0,0,0]
[null,0,0,0,0,0]
[null,0,0,0,0,{"$f":"(C2251-$N$11)*(C2251-$N$11)","v":0}]
[null,0,0,{"$f":"B2252*C2252","v":0},{"$f":"(B2252-$M$11)*(B2252-$M$11)","v":0},0]
[null,0,0,0,0,0]
[null,0,0,0,0,0]
[null,0,0,0,0,0]
[null,0,0,0,0,0]
[null,0,0,0,0,0]
[null,0,0,0,0,0]
[null,0,0,0,0,0]
[null,0,0,0,0,0]
[null,0,0,0,0,0]
[null,0,0,0,0,0]
[null,0,0,0,0,0]
[null,0,0,0,0,0]
[null,0,0,0,0,0]
[null,0,0,0,0,0]
[null,0,0,0,0,0]
[null,0,0,0,0,0]
[null,0,0,0,0,0]
[null,0,0,0,0,0]
[null,0,0,0,0,0]
[null,0,0,0,0,0]
[null,0,0,0,0,0]
[null,0,0,0,0,0]
[null,0,0,0,0,0]
[null,0,0,0,0,0]
[null,0,0,0,0,0]
[null,0,0,0,0,0]
[null,0,0,0,0,0]
[null,0,0,0,0,0]
[null,0,0,0,0,0]
[null,0,0,0,0,0]
[null,0,0,0,0,0]
[null,0,0,0,0,0]
[null,0,0,0,0,0]
[null,0,0,0,0,0]
[null,0,0,0,0,0]
[null,0,0,0,0,0]
[null,0,0,0,0,0]
[null,0,0,0,0,0]
[null,0,0,0,0,0]
[null,0,0,0,0,0]
[null,0,0,0,0,0]
[null,0,0,0,0,0]
[null,0,0,0,0,0]
[null,0,0,0,0,0]
[null,0,0,0,0,0]
[null,0,0,0,0,0]
[null,0,0,0,0,0]
[null,0,0,0,0,0]
[null,0,0,0,0,0]
[null,0,0,0,0,0]
[null,0,0,0,0,0]
[null,0,0,0,0,0]
[null,0,0,0,0,0]
[null,0,0,0,0,0]
[null,0,0,0,0,0]
[null,0,0,0,0,0]
[null,0,0,0,0,0]
[null,0,0,0,0,0]
[null,0,0,0,0,0]
[null,0,0,0,0,0]
[null,0,0,0,0,0]
[null,0,0,0,0,0]
[null,0,0,0,0,{"$f":"(C2315-$N$11)*(C2315-$N$11)","v":0}]
[null,0,0,{"$f":"B2316*C2316","v":0},{"$f":"(B2316-$M$11)*(B2316-$M$11)","v":0},0]
[null,0,0,0,0,0]
[null,0,0,0,0,0]
[null,0,0,0,0,0]
[null,0,0,0,0,0]
[null,0,0,0,0,0]
[null,0,0,0,0,0]
[null,0,0,0,0,0]
[null,0,0,0,0,0]
[null,0,0,0,0,0]
[null,0,0,0,0,0]
[null,0,0,0,0,0]
[null,0,0,0,0,0]
[null,0,0,0,0,0]
[null,0,0,0,0,0]
[null,0,0,0,0,0]
[null,0,0,0,0,0]
[null,0,0,0,0,0]
[null,0,0,0,0,0]
[null,0,0,0,0,0]
[null,0,0,0,0,0]
[null,0,0,0,0,0]
[null,0,0,0,0,0]
[null,0,0,0,0,0]
[null,0,0,0,0,0]
[null,0,0,0,0,0]
[null,0,0,0,0,0]
[null,0,0,0,0,0]
[null,0,0,0,0,0]
[null,0,0,0,0,0]
[null,0,0,0,0,0]
[null,0,0,0,0,0]
[null,0,0,0,0,0]
[null,0,0,0,0,0]
[null,0,0,0,0,0]
[null,0,0,0,0,0]
[null,0,0,0,0,0]
[null,0,0,0,0,0]
[null,0,0,0,0,0]
[null,0,0,0,0,0]
[null,0,0,0,0,0]
[null,0,0,0,0,0]
[null,0,0,0,0,0]
[null,0,0,0,0,0]
[null,0,0,0,0,0]
[null,0,0,0,0,0]
[null,0,0,0,0,0]
[null,0,0,0,0,0]
[null,0,0,0,0,0]
[null,0,0,0,0,0]
[null,0,0,0,0,0]
[null,0,0,0,0,0]
[null,0,0,0,0,0]
[null,0,0,0,0,0]
[null,0,0,0,0,0]
[null,0,0,0,0,0]
[null,0,0,0,0,0]
[null,0,0,0,0,0]
[null,0,0,0,0,0]
[null,0,0,0,0,0]
[null,0,0,0,0,0]
[null,0,0,0,0,0]
[null,0,0,0,0,0]
[null,0,0,0,0,{"$f":"(C2379-$N$11)*(C2379-$N$11)","v":0}]
[null,0,0,{"$f":"B2380*C2380","v":0},{"$f":"(B2380-$M$11)*(B2380-$M$11)","v":0},0]
[null,0,0,0,0,0]
[null,0,0,0,0,0]
[null,0,0,0,0,0]
[null,0,0,0,0,0]
[null,0,0,0,0,0]
[null,0,0,0,0,0]
[null,0,0,0,0,0]
[null,0,0,0,0,0]
[null,0,0,0,0,0]
[null,0,0,0,0,0]
[null,0,0,0,0,0]
[null,0,0,0,0,0]
[null,0,0,0,0,0]
[null,0,0,0,0,0]
[null,0,0,0,0,0]
[null,0,0,0,0,0]
[null,0,0,0,0,0]
[null,0,0,0,0,0]
[null,0,0,0,0,0]
[null,0,0,0,0,0]
[null,0,0,0,0,0]
[null,0,0,0,0,0]
[null,0,0,0,0,0]
[null,0,0,0,0,0]
[null,0,0,0,0,0]
[null,0,0,0,0,0]
[null,0,0,0,0,0]
[null,0,0,0,0,0]
[null,0,0,0,0,0]
[null,0,0,0,0,0]
[null,0,0,0,0,0]
[null,0,0,0,0,0]
[null,0,0,0,0,0]
[null,0,0,0,0,0]
[null,0,0,0,0,0]
[null,0,0,0,0,0]
[null,0,0,0,0,0]
[null,0,0,0,0,0]
[null,0,0,0,0,0]
[null,0,0,0,0,0]
[null,0,0,0,0,0]
[null,0,0,0,0,0]
[null,0,0,0,0,0]
[null,0,0,0,0,0]
[null,0,0,0,0,0]
[null,0,0,0,0,0]
[null,0,0,0,0,0]
[null,0,0,0,0,0]
[null,0,0,0,0,0]
[null,0,0,0,0,0]
[null,0,0,0,0,0]
[null,0,0,0,0,0]
[null,0,0,0,0,0]
[null,0,0,0,0,0]
[null,0,0,0,0,0]
[null,0,0,0,0,0]
[null,0,0,0,0,0]
[null,0,0,0,0,0]
[null,0,0,0,0,0]
[null,0,0,0,0,0]
[null,0,0,0,0,0]
[null,0,0,0,0,0]
[null,0,0,0,0,{"$f":"(C2443-$N$11)*(C2443-$N$11)","v":0}]
[null,0,0,{"$f":"B2444*C2444","v":0},{"$f":"(B2444-$M$11)*(B2444-$M$11)","v":0},0]
[null,0,0,0,0,0]
[null,0,0,0,0,0]
[null,0,0,0,0,0]
[null,0,0,0,0,0]
[null,0,0,0,0,0]
[null,0,0,0,0,0]
[null,0,0,0,0,0]
[null,0,0,0,0,0]
[null,0,0,0,0,0]
[null,0,0,0,0,0]
[null,0,0,0,0,0]
[null,0,0,0,0,0]
[null,0,0,0,0,0]
[null,0,0,0,0,0]
[null,0,0,0,0,0]
[null,0,0,0,0,0]
[null,0,0,0,0,0]
[null,0,0,0,0,0]
[null,0,0,0,0,0]
[null,0,0,0,0,0]
[null,0,0,0,0,0]
[null,0,0,0,0,0]
[null,0,0,0,0,0]
[null,0,0,0,0,0]
[null,0,0,0,0,0]
[null,0,0,0,0,0]
[null,0,0,0,0,0]
[null,0,0,0,0,0]
[null,0,0,0,0,0]
[null,0,0,0,0,0]
[null,0,0,0,0,0]
[null,0,0,0,0,0]
[null,0,0,0,0,0]
[null,0,0,0,0,0]
[null,0,0,0,0,0]
[null,0,0,0,0,0]
[null,0,0,0,0,0]
[null,0,0,0,0,0]
[null,0,0,0,0,0]
[null,0,0,0,0,0]
[null,0,0,0,0,0]
[null,0,0,0,0,0]
[null,0,0,0,0,0]
[null,0,0,0,0,0]
[null,0,0,0,0,0]
[null,0,0,0,0,0]
[null,0,0,0,0,0]
[null,0,0,0,0,0]
[null,0,0,0,0,0]
[null,0,0,0,0,0]
[null,0,0,0,0,0]
[null,0,0,0,0,0]
[null,0,0,0,0,0]
[null,0,0,0,0,0]
[null,0,0,0,0,0]
[null,0,0,0,0,0]
[null,0,0,0,0,0]
[null,0,0,0,0,0]
[null,0,0,0,0,0]
[null,0,0,0,0,0]
[null,0,0,0,0,0]
[null,0,0,0,0,0]
[null,0,0,0,0,{"$f":"(C2507-$N$11)*(C2507-$N$11)","v":0}]
[null,0,0,{"$f":"B2508*C2508","v":0},{"$f":"(B2508-$M$11)*(B2508-$M$11)","v":0},0]
[null,0,0,0,0,0]
[null,0,0,0,0,0]
[null,0,0,0,0,0]
[null,0,0,0,0,0]
[null,0,0,0,0,0]
[null,0,0,0,0,0]
[null,0,0,0,0,0]
[null,0,0,0,0,0]
[null,0,0,0,0,0]
[null,0,0,0,0,0]
[null,0,0,0,0,0]
[null,0,0,0,0,0]
[null,0,0,0,0,0]
[null,0,0,0,0,0]
[null,0,0,0,0,0]
[null,0,0,0,0,0]
[null,0,0,0,0,0]
[null,0,0,0,0,0]
[null,0,0,0,0,0]
[null,0,0,0,0,0]
[null,0,0,0,0,0]
[null,0,0,0,0,0]
[null,0,0,0,0,0]
[null,0,0,0,0,0]
[null,0,0,0,0,0]
[null,0,0,0,0,0]
[null,0,0,0,0,0]
[null,0,0,0,0,0]
[null,0,0,0,0,0]
[null,0,0,0,0,0]
[null,0,0,0,0,0]
[null,0,0,0,0,0]
[null,0,0,0,0,0]
[null,0,0,0,0,0]
[null,0,0,0,0,0]
[null,0,0,0,0,0]
[null,0,0,0,0,0]
[null,0,0,0,0,0]
[null,0,0,0,0,0]
[null,0,0,0,0,0]
[null,0,0,0,0,0]
[null,0,0,0,0,0]
[null,0,0,0,0,0]
[null,0,0,0,0,0]
[null,0,0,0,0,0]
[null,0,0,0,0,0]
[null,0,0,0,0,0]
[null,0,0,0,0,0]
[null,0,0,0,0,0]
[null,0,0,0,0,0]
[null,0,0,0,0,0]
[null,0,0,0,0,0]
[null,0,0,0,0,0]
[null,0,0,0,0,0]
[null,0,0,0,0,0]
[null,0,0,0,0,0]
[null,0,0,0,0,0]
[null,0,0,0,0,0]
[null,0,0,0,0,0]
[null,0,0,0,0,0]
[null,0,0,0,0,0]
[null,0,0,0,0,0]
[null,0,0,0,0,{"$f":"(C2571-$N$11)*(C2571-$N$11)","v":0}]
[null,0,0,{"$f":"B2572*C2572","v":0},{"$f":"(B2572-$M$11)*(B2572-$M$11)","v":0},0]
[null,0,0,0,0,0]
[null,0,0,0,0,0]
[null,0,0,0,0,0]
[null,0,0,0,0,0]
[null,0,0,0,0,0]
[null,0,0,0,0,0]
[null,0,0,0,0,0]
[null,0,0,0,0,0]
[null,0,0,0,0,0]
[null,0,0,0,0,0]
[null,0,0,0,0,0]
[null,0,0,0,0,0]
[null,0,0,0,0,0]
[null,0,0,0,0,0]
[null,0,0,0,0,0]
[null,0,0,0,0,0]
[null,0,0,0,0,0]
[null,0,0,0,0,0]
[null,0,0,0,0,0]
[null,0,0,0,0,0]
[null,0,0,0,0,0]
[null,0,0,0,0,0]
[null,0,0,0,0,0]
[null,0,0,0,0,0]
[null,0,0,0,0,0]
[null,0,0,0,0,0]
[null,0,0,0,0,0]
[null,0,0,0,0,0]
[null,0,0,0,0,0]
[null,0,0,0,0,0]
[null,0,0,0,0,0]
[null,0,0,0,0,0]

{"sheet":"Efficiency Meta-analysis","index":2,"n_rows":2602,"n_cols":14,"rows_kept":2602,"cut":false,"hidden":true,"merged":[[1,0,1,1],[6,6,24,10],[2,0,2,1],[1,6,4,15]]}
[]
["Efficiency index",null,"=",{"$f":"IFERROR(10^ABS(3*N12),0)","v":0},null,null,"This tab is available for you to calculate the efficiency index using a meta-analysis of studies found in literature."]
["Meta-analysis"]
[]
[]
["Study Identification","Population size (N)","Effect (r)","Nr",null,null,null,null,null,null,null,null,"Total N","Total r"]
["-",0,0,{"$f":"B7*C7","v":0},null,null,"You should calculate effect size r for each study using Pearson Correlation. Enter in the table the Effect (r) and population size (N) of each study.",null,null,null,null,null,{"$f":"SUM(B7:B2602)","v":0},{"$f":"SUM(C7:C2602)","v":0}]
["-",0,0,{"$f":"B8*C8","v":0}]
["-",0,0,{"$f":"B9*C9","v":0}]
[null,0,0,{"$f":"B10*C10","v":0}]
[null,0,0,0,null,null,null,null,null,null,null,null,null,"r"]
[null,0,0,0,null,null,null,null,null,null,null,null,null,{"$f":"M15/M7","v":{"$error":"#DIV/0!"}}]
[null,0,0,0]
[null,0,0,0,null,null,null,null,null,null,null,null,"Total Nr"]
[null,0,0,0,null,null,null,null,null,null,null,null,{"$f":"SUM(D7:D2602)","v":0}]
[null,0,0,0]
[null,0,0,0]
[null,0,0,0]
[null,0,0,0]
[null,0,0,0]
[null,0,0,0]
[null,0,0,0]
[null,0,0,0]
[null,0,0,0]
[null,0,0,0]
[null,0,0,0]
[null,0,0,0]
[null,0,0,0]
[null,0,0,0]
[null,0,0,0]
[null,0,0,0]
[null,0,0,0]
[null,0,0,0]
[null,0,0,0]
[null,0,0,0]
[null,0,0,0]
[null,0,0,0]
[null,0,0,0]
[null,0,0,0]
[null,0,0,0]
[null,0,0,0]
[null,0,0,0]
[null,0,0,0]
[null,0,0,0]
[null,0,0,0]
[null,0,0,0]
[null,0,0,0]
[null,0,0,0]
[null,0,0,0]
[null,0,0,0]
[null,0,0,0]
[null,0,0,0]
[null,0,0,0]
[null,0,0,0]
[null,0,0,0]
[null,0,0,0]
[null,0,0,0]
[null,0,0,0]
[null,0,0,0]
[null,0,0,0]
[null,0,0,0]
[null,0,0,0]
[null,0,0,0]
[null,0,0,0]
[null,0,0,0]
[null,0,0,0]
[null,0,0,0]
[null,0,0,0]
[null,0,0,0]
[null,0,0,0]
[null,0,0,0]
[null,0,0,0]
[null,0,0,0]
[null,0,0,{"$f":"B74*C74","v":0}]
[null,0,0,0]
[null,0,0,0]
[null,0,0,0]
[null,0,0,0]
[null,0,0,0]
[null,0,0,0]
[null,0,0,0]
[null,0,0,0]
[null,0,0,0]
[null,0,0,0]
[null,0,0,0]
[null,0,0,0]
[null,0,0,0]
[null,0,0,0]
[null,0,0,0]
[null,0,0,0]
[null,0,0,0]
[null,0,0,0]
[null,0,0,0]
[null,0,0,0]
[null,0,0,0]
[null,0,0,0]
[null,0,0,0]
[null,0,0,0]
[null,0,0,0]
[null,0,0,0]
[null,0,0,0]
[null,0,0,0]
[null,0,0,0]
[null,0,0,0]
[null,0,0,0]
[null,0,0,0]
[null,0,0,0]
[null,0,0,0]
[null,0,0,0]
[null,0,0,0]
[null,0,0,0]
[null,0,0,0]
[null,0,0,0]
[null,0,0,0]
[null,0,0,0]
[null,0,0,0]
[null,0,0,0]
[null,0,0,0]
[null,0,0,0]
[null,0,0,0]
[null,0,0,0]
[null,0,0,0]
[null,0,0,0]
[null,0,0,0]
[null,0,0,0]
[null,0,0,0]
[null,0,0,0]
[null,0,0,0]
[null,0,0,0]
[null,0,0,0]
[null,0,0,0]
[null,0,0,0]
[null,0,0,0]
[null,0,0,0]
[null,0,0,0]
[null,0,0,0]
[null,0,0,0]
[null,0,0,{"$f":"B138*C138","v":0}]
[null,0,0,0]
[null,0,0,0]
[null,0,0,0]
[null,0,0,0]
[null,0,0,0]
[null,0,0,0]
[null,0,0,0]
[null,0,0,0]
[null,0,0,0]
[null,0,0,0]
[null,0,0,0]
[null,0,0,0]
[null,0,0,0]
[null,0,0,0]
[null,0,0,0]
[null,0,0,0]
[null,0,0,0]
[null,0,0,0]
[null,0,0,0]
[null,0,0,0]
[null,0,0,0]
[null,0,0,0]
[null,0,0,0]
[null,0,0,0]
[null,0,0,0]
[null,0,0,0]
[null,0,0,0]
[null,0,0,0]
[null,0,0,0]
[null,0,0,0]
[null,0,0,0]
[null,0,0,0]
[null,0,0,0]
[null,0,0,0]
[null,0,0,0]
[null,0,0,0]
[null,0,0,0]
[null,0,0,0]
[null,0,0,0]
[null,0,0,0]
[null,0,0,0]
[null,0,0,0]
[null,0,0,0]
[null,0,0,0]
[null,0,0,0]
[null,0,0,0]
[null,0,0,0]
[null,0,0,0]
[null,0,0,0]
[null,0,0,0]
[null,0,0,0]
[null,0,0,0]
[null,0,0,0]
[null,0,0,0]
[null,0,0,0]
[null,0,0,0]
[null,0,0,0]
[null,0,0,0]
[null,0,0,0]
[null,0,0,0]
[null,0,0,0]
[null,0,0,0]
[null,0,0,0]
[null,0,0,{"$f":"B202*C202","v":0}]
[null,0,0,0]
[null,0,0,0]
[null,0,0,0]
[null,0,0,0]
[null,0,0,0]
[null,0,0,0]
[null,0,0,0]
[null,0,0,0]
[null,0,0,0]
[null,0,0,0]
[null,0,0,0]
[null,0,0,0]
[null,0,0,0]
[null,0,0,0]
[null,0,0,0]
[null,0,0,0]
[null,0,0,0]
[null,0,0,0]
[null,0,0,0]
[null,0,0,0]
[null,0,0,0]
[null,0,0,0]
[null,0,0,0]
[null,0,0,0]
[null,0,0,0]
[null,0,0,0]
[null,0,0,0]
[null,0,0,0]
[null,0,0,0]
[null,0,0,0]
[null,0,0,0]
[null,0,0,0]
[null,0,0,0]
[null,0,0,0]
[null,0,0,0]
[null,0,0,0]
[null,0,0,0]
[null,0,0,0]
[null,0,0,0]
[null,0,0,0]
[null,0,0,0]
[null,0,0,0]
[null,0,0,0]
[null,0,0,0]
[null,0,0,0]
[null,0,0,0]
[null,0,0,0]
[null,0,0,0]
[null,0,0,0]
[null,0,0,0]
[null,0,0,0]
[null,0,0,0]
[null,0,0,0]
[null,0,0,0]
[null,0,0,0]
[null,0,0,0]
[null,0,0,0]
[null,0,0,0]
[null,0,0,0]
[null,0,0,0]
[null,0,0,0]
[null,0,0,0]
[null,0,0,0]
[null,0,0,{"$f":"B266*C266","v":0}]
[null,0,0,0]
[null,0,0,0]
[null,0,0,0]
[null,0,0,0]
[null,0,0,0]
[null,0,0,0]
[null,0,0,0]
[null,0,0,0]
[null,0,0,0]
[null,0,0,0]
[null,0,0,0]
[null,0,0,0]
[null,0,0,0]
[null,0,0,0]
[null,0,0,0]
[null,0,0,0]
[null,0,0,0]
[null,0,0,0]
[null,0,0,0]
[null,0,0,0]
[null,0,0,0]
[null,0,0,0]
[null,0,0,0]
[null,0,0,0]
[null,0,0,0]
[null,0,0,0]
[null,0,0,0]
[null,0,0,0]
[null,0,0,0]
[null,0,0,0]
[null,0,0,0]
[null,0,0,0]
[null,0,0,0]
[null,0,0,0]
[null,0,0,0]
[null,0,0,0]
[null,0,0,0]
[null,0,0,0]
[null,0,0,0]
[null,0,0,0]
[null,0,0,0]
[null,0,0,0]
[null,0,0,0]
[null,0,0,0]
[null,0,0,0]
[null,0,0,0]
[null,0,0,0]
[null,0,0,0]
[null,0,0,0]
[null,0,0,0]
[null,0,0,0]
[null,0,0,0]
[null,0,0,0]
[null,0,0,0]
[null,0,0,0]
[null,0,0,0]
[null,0,0,0]
[null,0,0,0]
[null,0,0,0]
[null,0,0,0]
[null,0,0,0]
[null,0,0,0]
[null,0,0,0]
[null,0,0,{"$f":"B330*C330","v":0}]
[null,0,0,0]
[null,0,0,0]
[null,0,0,0]
[null,0,0,0]
[null,0,0,0]
[null,0,0,0]
[null,0,0,0]
[null,0,0,0]
[null,0,0,0]
[null,0,0,0]
[null,0,0,0]
[null,0,0,0]
[null,0,0,0]
[null,0,0,0]
[null,0,0,0]
[null,0,0,0]
[null,0,0,0]
[null,0,0,0]
[null,0,0,0]
[null,0,0,0]
[null,0,0,0]
[null,0,0,0]
[null,0,0,0]
[null,0,0,0]
[null,0,0,0]
[null,0,0,0]
[null,0,0,0]
[null,0,0,0]
[null,0,0,0]
[null,0,0,0]
[null,0,0,0]
[null,0,0,0]
[null,0,0,0]
[null,0,0,0]
[null,0,0,0]
[null,0,0,0]
[null,0,0,0]
[null,0,0,0]
[null,0,0,0]
[null,0,0,0]
[null,0,0,0]
[null,0,0,0]
[null,0,0,0]
[null,0,0,0]
[null,0,0,0]
[null,0,0,0]
[null,0,0,0]
[null,0,0,0]
[null,0,0,0]
[null,0,0,0]
[null,0,0,0]
[null,0,0,0]
[null,0,0,0]
[null,0,0,0]
[null,0,0,0]
[null,0,0,0]
[null,0,0,0]
[null,0,0,0]
[null,0,0,0]
[null,0,0,0]
[null,0,0,0]
[null,0,0,0]
[null,0,0,0]
[null,0,0,{"$f":"B394*C394","v":0}]
[null,0,0,0]
[null,0,0,0]
[null,0,0,0]
[null,0,0,0]
[null,0,0,0]
[null,0,0,0]
[null,0,0,0]
[null,0,0,0]
[null,0,0,0]
[null,0,0,0]
[null,0,0,0]
[null,0,0,0]
[null,0,0,0]
[null,0,0,0]
[null,0,0,0]
[null,0,0,0]
[null,0,0,0]
[null,0,0,0]
[null,0,0,0]
[null,0,0,0]
[null,0,0,0]
[null,0,0,0]
[null,0,0,0]
[null,0,0,0]
[null,0,0,0]
[null,0,0,0]
[null,0,0,0]
[null,0,0,0]
[null,0,0,0]
[null,0,0,0]
[null,0,0,0]
[null,0,0,0]
[null,0,0,0]
[null,0,0,0]
[null,0,0,0]
[null,0,0,0]
[null,0,0,0]
[null,0,0,0]
[null,0,0,0]
[null,0,0,0]
[null,0,0,0]
[null,0,0,0]
[null,0,0,0]
[null,0,0,0]
[null,0,0,0]
[null,0,0,0]
[null,0,0,0]
[null,0,0,0]
[null,0,0,0]
[null,0,0,0]
[null,0,0,0]
[null,0,0,0]
[null,0,0,0]
[null,0,0,0]
[null,0,0,0]
[null,0,0,0]
[null,0,0,0]
[null,0,0,0]
[null,0,0,0]
[null,0,0,0]
[null,0,0,0]
[null,0,0,0]
[null,0,0,0]
[null,0,0,{"$f":"B458*C458","v":0}]
[null,0,0,0]
[null,0,0,0]
[null,0,0,0]
[null,0,0,0]
[null,0,0,0]
[null,0,0,0]
[null,0,0,0]
[null,0,0,0]
[null,0,0,0]
[null,0,0,0]
[null,0,0,0]
[null,0,0,0]
[null,0,0,0]
[null,0,0,0]
[null,0,0,0]
[null,0,0,0]
[null,0,0,0]
[null,0,0,0]
[null,0,0,0]
[null,0,0,0]
[null,0,0,0]
[null,0,0,0]
[null,0,0,0]
[null,0,0,0]
[null,0,0,0]
[null,0,0,0]
[null,0,0,0]
[null,0,0,0]
[null,0,0,0]
[null,0,0,0]
[null,0,0,0]
[null,0,0,0]
[null,0,0,0]
[null,0,0,0]
[null,0,0,0]
[null,0,0,0]
[null,0,0,0]
[null,0,0,0]
[null,0,0,0]
[null,0,0,0]
[null,0,0,0]
[null,0,0,0]
[null,0,0,0]
[null,0,0,0]
[null,0,0,0]
[null,0,0,0]
[null,0,0,0]
[null,0,0,0]
[null,0,0,0]
[null,0,0,0]
[null,0,0,0]
[null,0,0,0]
[null,0,0,0]
[null,0,0,0]
[null,0,0,0]
[null,0,0,0]
[null,0,0,0]
[null,0,0,0]
[null,0,0,0]
[null,0,0,0]
[null,0,0,0]
[null,0,0,0]
[null,0,0,0]
[null,0,0,{"$f":"B522*C522","v":0}]
[null,0,0,0]
[null,0,0,0]
[null,0,0,0]
[null,0,0,0]
[null,0,0,0]
[null,0,0,0]
[null,0,0,0]
[null,0,0,0]
[null,0,0,0]
[null,0,0,0]
[null,0,0,0]
[null,0,0,0]
[null,0,0,0]
[null,0,0,0]
[null,0,0,0]
[null,0,0,0]
[null,0,0,0]
[null,0,0,0]
[null,0,0,0]
[null,0,0,0]
[null,0,0,0]
[null,0,0,0]
[null,0,0,0]
[null,0,0,0]
[null,0,0,0]
[null,0,0,0]
[null,0,0,0]
[null,0,0,0]
[null,0,0,0]
[null,0,0,0]
[null,0,0,0]
[null,0,0,0]
[null,0,0,0]
[null,0,0,0]
[null,0,0,0]
[null,0,0,0]
[null,0,0,0]
[null,0,0,0]
[null,0,0,0]
[null,0,0,0]
[null,0,0,0]
[null,0,0,0]
[null,0,0,0]
[null,0,0,0]
[null,0,0,0]
[null,0,0,0]
[null,0,0,0]
[null,0,0,0]
[null,0,0,0]
[null,0,0,0]
[null,0,0,0]
[null,0,0,0]
[null,0,0,0]
[null,0,0,0]
[null,0,0,0]
[null,0,0,0]
[null,0,0,0]
[null,0,0,0]
[null,0,0,0]
[null,0,0,0]
[null,0,0,0]
[null,0,0,0]
[null,0,0,0]
[null,0,0,{"$f":"B586*C586","v":0}]
[null,0,0,0]
[null,0,0,0]
[null,0,0,0]
[null,0,0,0]
[null,0,0,0]
[null,0,0,0]
[null,0,0,0]
[null,0,0,0]
[null,0,0,0]
[null,0,0,0]
[null,0,0,0]
[null,0,0,0]
[null,0,0,0]
[null,0,0,0]
[null,0,0,0]
[null,0,0,0]
[null,0,0,0]
[null,0,0,0]
[null,0,0,0]
[null,0,0,0]
[null,0,0,0]
[null,0,0,0]
[null,0,0,0]
[null,0,0,0]
[null,0,0,0]
[null,0,0,0]
[null,0,0,0]
[null,0,0,0]
[null,0,0,0]
[null,0,0,0]
[null,0,0,0]
[null,0,0,0]
[null,0,0,0]
[null,0,0,0]
[null,0,0,0]
[null,0,0,0]
[null,0,0,0]
[null,0,0,0]
[null,0,0,0]
[null,0,0,0]
[null,0,0,0]
[null,0,0,0]
[null,0,0,0]
[null,0,0,0]
[null,0,0,0]
[null,0,0,0]
[null,0,0,0]
[null,0,0,0]
[null,0,0,0]
[null,0,0,0]
[null,0,0,0]
[null,0,0,0]
[null,0,0,0]
[null,0,0,0]
[null,0,0,0]
[null,0,0,0]
[null,0,0,0]
[null,0,0,0]
[null,0,0,0]
[null,0,0,0]
[null,0,0,0]
[null,0,0,0]
[null,0,0,0]
[null,0,0,{"$f":"B650*C650","v":0}]
[null,0,0,0]
[null,0,0,0]
[null,0,0,0]
[null,0,0,0]
[null,0,0,0]
[null,0,0,0]
[null,0,0,0]
[null,0,0,0]
[null,0,0,0]
[null,0,0,0]
[null,0,0,0]
[null,0,0,0]
[null,0,0,0]
[null,0,0,0]
[null,0,0,0]
[null,0,0,0]
[null,0,0,0]
[null,0,0,0]
[null,0,0,0]
[null,0,0,0]
[null,0,0,0]
[null,0,0,0]
[null,0,0,0]
[null,0,0,0]
[null,0,0,0]
[null,0,0,0]
[null,0,0,0]
[null,0,0,0]
[null,0,0,0]
[null,0,0,0]
[null,0,0,0]
[null,0,0,0]
[null,0,0,0]
[null,0,0,0]
[null,0,0,0]
[null,0,0,0]
[null,0,0,0]
[null,0,0,0]
[null,0,0,0]
[null,0,0,0]
[null,0,0,0]
[null,0,0,0]
[null,0,0,0]
[null,0,0,0]
[null,0,0,0]
[null,0,0,0]
[null,0,0,0]
[null,0,0,0]
[null,0,0,0]
[null,0,0,0]
[null,0,0,0]
[null,0,0,0]
[null,0,0,0]
[null,0,0,0]
[null,0,0,0]
[null,0,0,0]
[null,0,0,0]
[null,0,0,0]
[null,0,0,0]
[null,0,0,0]
[null,0,0,0]
[null,0,0,0]
[null,0,0,0]
[null,0,0,{"$f":"B714*C714","v":0}]
[null,0,0,0]
[null,0,0,0]
[null,0,0,0]
[null,0,0,0]
[null,0,0,0]
[null,0,0,0]
[null,0,0,0]
[null,0,0,0]
[null,0,0,0]
[null,0,0,0]
[null,0,0,0]
[null,0,0,0]
[null,0,0,0]
[null,0,0,0]
[null,0,0,0]
[null,0,0,0]
[null,0,0,0]
[null,0,0,0]
[null,0,0,0]
[null,0,0,0]
[null,0,0,0]
[null,0,0,0]
[null,0,0,0]
[null,0,0,0]
[null,0,0,0]
[null,0,0,0]
[null,0,0,0]
[null,0,0,0]
[null,0,0,0]
[null,0,0,0]
[null,0,0,0]
[null,0,0,0]
[null,0,0,0]
[null,0,0,0]
[null,0,0,0]
[null,0,0,0]
[null,0,0,0]
[null,0,0,0]
[null,0,0,0]
[null,0,0,0]
[null,0,0,0]
[null,0,0,0]
[null,0,0,0]
[null,0,0,0]
[null,0,0,0]
[null,0,0,0]
[null,0,0,0]
[null,0,0,0]
[null,0,0,0]
[null,0,0,0]
[null,0,0,0]
[null,0,0,0]
[null,0,0,0]
[null,0,0,0]
[null,0,0,0]
[null,0,0,0]
[null,0,0,0]
[null,0,0,0]
[null,0,0,0]
[null,0,0,0]
[null,0,0,0]
[null,0,0,0]
[null,0,0,0]
[null,0,0,{"$f":"B778*C778","v":0}]
[null,0,0,0]
[null,0,0,0]
[null,0,0,0]
[null,0,0,0]
[null,0,0,0]
[null,0,0,0]
[null,0,0,0]
[null,0,0,0]
[null,0,0,0]
[null,0,0,0]
[null,0,0,0]
[null,0,0,0]
[null,0,0,0]
[null,0,0,0]
[null,0,0,0]
[null,0,0,0]
[null,0,0,0]
[null,0,0,0]
[null,0,0,0]
[null,0,0,0]
[null,0,0,0]
[null,0,0,0]
[null,0,0,0]
[null,0,0,0]
[null,0,0,0]
[null,0,0,0]
[null,0,0,0]
[null,0,0,0]
[null,0,0,0]
[null,0,0,0]
[null,0,0,0]
[null,0,0,0]
[null,0,0,0]
[null,0,0,0]
[null,0,0,0]
[null,0,0,0]
[null,0,0,0]
[null,0,0,0]
[null,0,0,0]
[null,0,0,0]
[null,0,0,0]
[null,0,0,0]
[null,0,0,0]
[null,0,0,0]
[null,0,0,0]
[null,0,0,0]
[null,0,0,0]
[null,0,0,0]
[null,0,0,0]
[null,0,0,0]
[null,0,0,0]
[null,0,0,0]
[null,0,0,0]
[null,0,0,0]
[null,0,0,0]
[null,0,0,0]
[null,0,0,0]
[null,0,0,0]
[null,0,0,0]
[null,0,0,0]
[null,0,0,0]
[null,0,0,0]
[null,0,0,0]
[null,0,0,{"$f":"B842*C842","v":0}]
[null,0,0,0]
[null,0,0,0]
[null,0,0,0]
[null,0,0,0]
[null,0,0,0]
[null,0,0,0]
[null,0,0,0]
[null,0,0,0]
[null,0,0,0]
[null,0,0,0]
[null,0,0,0]
[null,0,0,0]
[null,0,0,0]
[null,0,0,0]
[null,0,0,0]
[null,0,0,0]
[null,0,0,0]
[null,0,0,0]
[null,0,0,0]
[null,0,0,0]
[null,0,0,0]
[null,0,0,0]
[null,0,0,0]
[null,0,0,0]
[null,0,0,0]
[null,0,0,0]
[null,0,0,0]
[null,0,0,0]
[null,0,0,0]
[null,0,0,0]
[null,0,0,0]
[null,0,0,0]
[null,0,0,0]
[null,0,0,0]
[null,0,0,0]
[null,0,0,0]
[null,0,0,0]
[null,0,0,0]
[null,0,0,0]
[null,0,0,0]
[null,0,0,0]
[null,0,0,0]
[null,0,0,0]
[null,0,0,0]
[null,0,0,0]
[null,0,0,0]
[null,0,0,0]
[null,0,0,0]
[null,0,0,0]
[null,0,0,0]
[null,0,0,0]
[null,0,0,0]
[null,0,0,0]
[null,0,0,0]
[null,0,0,0]
[null,0,0,0]
[null,0,0,0]
[null,0,0,0]
[null,0,0,0]
[null,0,0,0]
[null,0,0,0]
[null,0,0,0]
[null,0,0,0]
[null,0,0,{"$f":"B906*C906","v":0}]
[null,0,0,0]
[null,0,0,0]
[null,0,0,0]
[null,0,0,0]
[null,0,0,0]
[null,0,0,0]
[null,0,0,0]
[null,0,0,0]
[null,0,0,0]
[null,0,0,0]
[null,0,0,0]
[null,0,0,0]
[null,0,0,0]
[null,0,0,0]
[null,0,0,0]
[null,0,0,0]
[null,0,0,0]
[null,0,0,0]
[null,0,0,0]
[null,0,0,0]
[null,0,0,0]
[null,0,0,0]
[null,0,0,0]
[null,0,0,0]
[null,0,0,0]
[null,0,0,0]
[null,0,0,0]
[null,0,0,0]
[null,0,0,0]
[null,0,0,0]
[null,0,0,0]
[null,0,0,0]
[null,0,0,0]
[null,0,0,0]
[null,0,0,0]
[null,0,0,0]
[null,0,0,0]
[null,0,0,0]
[null,0,0,0]
[null,0,0,0]
[null,0,0,0]
[null,0,0,0]
[null,0,0,0]
[null,0,0,0]
[null,0,0,0]
[null,0,0,0]
[null,0,0,0]
[null,0,0,0]
[null,0,0,0]
[null,0,0,0]
[null,0,0,0]
[null,0,0,0]
[null,0,0,0]
[null,0,0,0]
[null,0,0,0]
[null,0,0,0]
[null,0,0,0]
[null,0,0,0]
[null,0,0,0]
[null,0,0,0]
[null,0,0,0]
[null,0,0,0]
[null,0,0,0]
[null,0,0,{"$f":"B970*C970","v":0}]
[null,0,0,0]
[null,0,0,0]
[null,0,0,0]
[null,0,0,0]
[null,0,0,0]
[null,0,0,0]
[null,0,0,0]
[null,0,0,0]
[null,0,0,0]
[null,0,0,0]
[null,0,0,0]
[null,0,0,0]
[null,0,0,0]
[null,0,0,0]
[null,0,0,0]
[null,0,0,0]
[null,0,0,0]
[null,0,0,0]
[null,0,0,0]
[null,0,0,0]
[null,0,0,0]
[null,0,0,0]
[null,0,0,0]
[null,0,0,0]
[null,0,0,0]
[null,0,0,0]
[null,0,0,0]
[null,0,0,0]
[null,0,0,0]
[null,0,0,0]
[null,0,0,0]
[null,0,0,0]
[null,0,0,0]
[null,0,0,0]
[null,0,0,0]
[null,0,0,0]
[null,0,0,0]
[null,0,0,0]
[null,0,0,0]
[null,0,0,0]
[null,0,0,0]
[null,0,0,0]
[null,0,0,0]
[null,0,0,0]
[null,0,0,0]
[null,0,0,0]
[null,0,0,0]
[null,0,0,0]
[null,0,0,0]
[null,0,0,0]
[null,0,0,0]
[null,0,0,0]
[null,0,0,0]
[null,0,0,0]
[null,0,0,0]
[null,0,0,0]
[null,0,0,0]
[null,0,0,0]
[null,0,0,0]
[null,0,0,0]
[null,0,0,0]
[null,0,0,0]
[null,0,0,0]
[null,0,0,{"$f":"B1034*C1034","v":0}]
[null,0,0,0]
[null,0,0,0]
[null,0,0,0]
[null,0,0,0]
[null,0,0,0]
[null,0,0,0]
[null,0,0,0]
[null,0,0,0]
[null,0,0,0]
[null,0,0,0]
[null,0,0,0]
[null,0,0,0]
[null,0,0,0]
[null,0,0,0]
[null,0,0,0]
[null,0,0,0]
[null,0,0,0]
[null,0,0,0]
[null,0,0,0]
[null,0,0,0]
[null,0,0,0]
[null,0,0,0]
[null,0,0,0]
[null,0,0,0]
[null,0,0,0]
[null,0,0,0]
[null,0,0,0]
[null,0,0,0]
[null,0,0,0]
[null,0,0,0]
[null,0,0,0]
[null,0,0,0]
[null,0,0,0]
[null,0,0,0]
[null,0,0,0]
[null,0,0,0]
[null,0,0,0]
[null,0,0,0]
[null,0,0,0]
[null,0,0,0]
[null,0,0,0]
[null,0,0,0]
[null,0,0,0]
[null,0,0,0]
[null,0,0,0]
[null,0,0,0]
[null,0,0,0]
[null,0,0,0]
[null,0,0,0]
[null,0,0,0]
[null,0,0,0]
[null,0,0,0]
[null,0,0,0]
[null,0,0,0]
[null,0,0,0]
[null,0,0,0]
[null,0,0,0]
[null,0,0,0]
[null,0,0,0]
[null,0,0,0]
[null,0,0,0]
[null,0,0,0]
[null,0,0,0]
[null,0,0,{"$f":"B1098*C1098","v":0}]
[null,0,0,0]
[null,0,0,0]
[null,0,0,0]
[null,0,0,0]
[null,0,0,0]
[null,0,0,0]
[null,0,0,0]
[null,0,0,0]
[null,0,0,0]
[null,0,0,0]
[null,0,0,0]
[null,0,0,0]
[null,0,0,0]
[null,0,0,0]
[null,0,0,0]
[null,0,0,0]
[null,0,0,0]
[null,0,0,0]
[null,0,0,0]
[null,0,0,0]
[null,0,0,0]
[null,0,0,0]
[null,0,0,0]
[null,0,0,0]
[null,0,0,0]
[null,0,0,0]
[null,0,0,0]
[null,0,0,0]
[null,0,0,0]
[null,0,0,0]
[null,0,0,0]
[null,0,0,0]
[null,0,0,0]
[null,0,0,0]
[null,0,0,0]
[null,0,0,0]
[null,0,0,0]
[null,0,0,0]
[null,0,0,0]
[null,0,0,0]
[null,0,0,0]
[null,0,0,0]
[null,0,0,0]
[null,0,0,0]
[null,0,0,0]
[null,0,0,0]
[null,0,0,0]
[null,0,0,0]
[null,0,0,0]
[null,0,0,0]
[null,0,0,0]
[null,0,0,0]
[null,0,0,0]
[null,0,0,0]
[null,0,0,0]
[null,0,0,0]
[null,0,0,0]
[null,0,0,0]
[null,0,0,0]
[null,0,0,0]
[null,0,0,0]
[null,0,0,0]
[null,0,0,0]
[null,0,0,{"$f":"B1162*C1162","v":0}]
[null,0,0,0]
[null,0,0,0]
[null,0,0,0]
[null,0,0,0]
[null,0,0,0]
[null,0,0,0]
[null,0,0,0]
[null,0,0,0]
[null,0,0,0]
[null,0,0,0]
[null,0,0,0]
[null,0,0,0]
[null,0,0,0]
[null,0,0,0]
[null,0,0,0]
[null,0,0,0]
[null,0,0,0]
[null,0,0,0]
[null,0,0,0]
[null,0,0,0]
[null,0,0,0]
[null,0,0,0]
[null,0,0,0]
[null,0,0,0]
[null,0,0,0]
[null,0,0,0]
[null,0,0,0]
[null,0,0,0]
[null,0,0,0]
[null,0,0,0]
[null,0,0,0]
[null,0,0,0]
[null,0,0,0]
[null,0,0,0]
[null,0,0,0]
[null,0,0,0]
[null,0,0,0]
[null,0,0,0]
[null,0,0,0]
[null,0,0,0]
[null,0,0,0]
[null,0,0,0]
[null,0,0,0]
[null,0,0,0]
[null,0,0,0]
[null,0,0,0]
[null,0,0,0]
[null,0,0,0]
[null,0,0,0]
[null,0,0,0]
[null,0,0,0]
[null,0,0,0]
[null,0,0,0]
[null,0,0,0]
[null,0,0,0]
[null,0,0,0]
[null,0,0,0]
[null,0,0,0]
[null,0,0,0]
[null,0,0,0]
[null,0,0,0]
[null,0,0,0]
[null,0,0,0]
[null,0,0,{"$f":"B1226*C1226","v":0}]
[null,0,0,0]
[null,0,0,0]
[null,0,0,0]
[null,0,0,0]
[null,0,0,0]
[null,0,0,0]
[null,0,0,0]
[null,0,0,0]
[null,0,0,0]
[null,0,0,0]
[null,0,0,0]
[null,0,0,0]
[null,0,0,0]
[null,0,0,0]
[null,0,0,0]
[null,0,0,0]
[null,0,0,0]
[null,0,0,0]
[null,0,0,0]
[null,0,0,0]
[null,0,0,0]
[null,0,0,0]
[null,0,0,0]
[null,0,0,0]
[null,0,0,0]
[null,0,0,0]
[null,0,0,0]
[null,0,0,0]
[null,0,0,0]
[null,0,0,0]
[null,0,0,0]
[null,0,0,0]
[null,0,0,0]
[null,0,0,0]
[null,0,0,0]
[null,0,0,0]
[null,0,0,0]
[null,0,0,0]
[null,0,0,0]
[null,0,0,0]
[null,0,0,0]
[null,0,0,0]
[null,0,0,0]
[null,0,0,0]
[null,0,0,0]
[null,0,0,0]
[null,0,0,0]
[null,0,0,0]
[null,0,0,0]
[null,0,0,0]
[null,0,0,0]
[null,0,0,0]
[null,0,0,0]
[null,0,0,0]
[null,0,0,0]
[null,0,0,0]
[null,0,0,0]
[null,0,0,0]
[null,0,0,0]
[null,0,0,0]
[null,0,0,0]
[null,0,0,0]
[null,0,0,0]
[null,0,0,{"$f":"B1290*C1290","v":0}]
[null,0,0,0]
[null,0,0,0]
[null,0,0,0]
[null,0,0,0]
[null,0,0,0]
[null,0,0,0]
[null,0,0,0]
[null,0,0,0]
[null,0,0,0]
[null,0,0,0]
[null,0,0,0]
[null,0,0,0]
[null,0,0,0]
[null,0,0,0]
[null,0,0,0]
[null,0,0,0]
[null,0,0,0]
[null,0,0,0]
[null,0,0,0]
[null,0,0,0]
[null,0,0,0]
[null,0,0,0]
[null,0,0,0]
[null,0,0,0]
[null,0,0,0]
[null,0,0,0]
[null,0,0,0]
[null,0,0,0]
[null,0,0,0]
[null,0,0,0]
[null,0,0,0]
[null,0,0,0]
[null,0,0,0]
[null,0,0,0]
[null,0,0,0]
[null,0,0,0]
[null,0,0,0]
[null,0,0,0]
[null,0,0,0]
[null,0,0,0]
[null,0,0,0]
[null,0,0,0]
[null,0,0,0]
[null,0,0,0]
[null,0,0,0]
[null,0,0,0]
[null,0,0,0]
[null,0,0,0]
[null,0,0,0]
[null,0,0,0]
[null,0,0,0]
[null,0,0,0]
[null,0,0,0]
[null,0,0,0]
[null,0,0,0]
[null,0,0,0]
[null,0,0,0]
[null,0,0,0]
[null,0,0,0]
[null,0,0,0]
[null,0,0,0]
[null,0,0,0]
[null,0,0,0]
[null,0,0,{"$f":"B1354*C1354","v":0}]
[null,0,0,0]
[null,0,0,0]
[null,0,0,0]
[null,0,0,0]
[null,0,0,0]
[null,0,0,0]
[null,0,0,0]
[null,0,0,0]
[null,0,0,0]
[null,0,0,0]
[null,0,0,0]
[null,0,0,0]
[null,0,0,0]
[null,0,0,0]
[null,0,0,0]
[null,0,0,0]
[null,0,0,0]
[null,0,0,0]
[null,0,0,0]
[null,0,0,0]
[null,0,0,0]
[null,0,0,0]
[null,0,0,0]
[null,0,0,0]
[null,0,0,0]
[null,0,0,0]
[null,0,0,0]
[null,0,0,0]
[null,0,0,0]
[null,0,0,0]
[null,0,0,0]
[null,0,0,0]
[null,0,0,0]
[null,0,0,0]
[null,0,0,0]
[null,0,0,0]
[null,0,0,0]
[null,0,0,0]
[null,0,0,0]
[null,0,0,0]
[null,0,0,0]
[null,0,0,0]
[null,0,0,0]
[null,0,0,0]
[null,0,0,0]
[null,0,0,0]
[null,0,0,0]
[null,0,0,0]
[null,0,0,0]
[null,0,0,0]
[null,0,0,0]
[null,0,0,0]
[null,0,0,0]
[null,0,0,0]
[null,0,0,0]
[null,0,0,0]
[null,0,0,0]
[null,0,0,0]
[null,0,0,0]
[null,0,0,0]
[null,0,0,0]
[null,0,0,0]
[null,0,0,0]
[null,0,0,{"$f":"B1418*C1418","v":0}]
[null,0,0,0]
[null,0,0,0]
[null,0,0,0]
[null,0,0,0]
[null,0,0,0]
[null,0,0,0]
[null,0,0,0]
[null,0,0,0]
[null,0,0,0]
[null,0,0,0]
[null,0,0,0]
[null,0,0,0]
[null,0,0,0]
[null,0,0,0]
[null,0,0,0]
[null,0,0,0]
[null,0,0,0]
[null,0,0,0]
[null,0,0,0]
[null,0,0,0]
[null,0,0,0]
[null,0,0,0]
[null,0,0,0]
[null,0,0,0]
[null,0,0,0]
[null,0,0,0]
[null,0,0,0]
[null,0,0,0]
[null,0,0,0]
[null,0,0,0]
[null,0,0,0]
[null,0,0,0]
[null,0,0,0]
[null,0,0,0]
[null,0,0,0]
[null,0,0,0]
[null,0,0,0]
[null,0,0,0]
[null,0,0,0]
[null,0,0,0]
[null,0,0,0]
[null,0,0,0]
[null,0,0,0]
[null,0,0,0]
[null,0,0,0]
[null,0,0,0]
[null,0,0,0]
[null,0,0,0]
[null,0,0,0]
[null,0,0,0]
[null,0,0,0]
[null,0,0,0]
[null,0,0,0]
[null,0,0,0]
[null,0,0,0]
[null,0,0,0]
[null,0,0,0]
[null,0,0,0]
[null,0,0,0]
[null,0,0,0]
[null,0,0,0]
[null,0,0,0]
[null,0,0,0]
[null,0,0,{"$f":"B1482*C1482","v":0}]
[null,0,0,0]
[null,0,0,0]
[null,0,0,0]
[null,0,0,0]
[null,0,0,0]
[null,0,0,0]
[null,0,0,0]
[null,0,0,0]
[null,0,0,0]
[null,0,0,0]
[null,0,0,0]
[null,0,0,0]
[null,0,0,0]
[null,0,0,0]
[null,0,0,0]
[null,0,0,0]
[null,0,0,0]
[null,0,0,0]
[null,0,0,0]
[null,0,0,0]
[null,0,0,0]
[null,0,0,0]
[null,0,0,0]
[null,0,0,0]
[null,0,0,0]
[null,0,0,0]
[null,0,0,0]
[null,0,0,0]
[null,0,0,0]
[null,0,0,0]
[null,0,0,0]
[null,0,0,0]
[null,0,0,0]
[null,0,0,0]
[null,0,0,0]
[null,0,0,0]
[null,0,0,0]
[null,0,0,0]
[null,0,0,0]
[null,0,0,0]
[null,0,0,0]
[null,0,0,0]
[null,0,0,0]
[null,0,0,0]
[null,0,0,0]
[null,0,0,0]
[null,0,0,0]
[null,0,0,0]
[null,0,0,0]
[null,0,0,0]
[null,0,0,0]
[null,0,0,0]
[null,0,0,0]
[null,0,0,0]
[null,0,0,0]
[null,0,0,0]
[null,0,0,0]
[null,0,0,0]
[null,0,0,0]
[null,0,0,0]
[null,0,0,0]
[null,0,0,0]
[null,0,0,0]
[null,0,0,{"$f":"B1546*C1546","v":0}]
[null,0,0,0]
[null,0,0,0]
[null,0,0,0]
[null,0,0,0]
[null,0,0,0]
[null,0,0,0]
[null,0,0,0]
[null,0,0,0]
[null,0,0,0]
[null,0,0,0]
[null,0,0,0]
[null,0,0,0]
[null,0,0,0]
[null,0,0,0]
[null,0,0,0]
[null,0,0,0]
[null,0,0,0]
[null,0,0,0]
[null,0,0,0]
[null,0,0,0]
[null,0,0,0]
[null,0,0,0]
[null,0,0,0]
[null,0,0,0]
[null,0,0,0]
[null,0,0,0]
[null,0,0,0]
[null,0,0,0]
[null,0,0,0]
[null,0,0,0]
[null,0,0,0]
[null,0,0,0]
[null,0,0,0]
[null,0,0,0]
[null,0,0,0]
[null,0,0,0]
[null,0,0,0]
[null,0,0,0]
[null,0,0,0]
[null,0,0,0]
[null,0,0,0]
[null,0,0,0]
[null,0,0,0]
[null,0,0,0]
[null,0,0,0]
[null,0,0,0]
[null,0,0,0]
[null,0,0,0]
[null,0,0,0]
[null,0,0,0]
[null,0,0,0]
[null,0,0,0]
[null,0,0,0]
[null,0,0,0]
[null,0,0,0]
[null,0,0,0]
[null,0,0,0]
[null,0,0,0]
[null,0,0,0]
[null,0,0,0]
[null,0,0,0]
[null,0,0,0]
[null,0,0,0]
[null,0,0,{"$f":"B1610*C1610","v":0}]
[null,0,0,0]
[null,0,0,0]
[null,0,0,0]
[null,0,0,0]
[null,0,0,0]
[null,0,0,0]
[null,0,0,0]
[null,0,0,0]
[null,0,0,0]
[null,0,0,0]
[null,0,0,0]
[null,0,0,0]
[null,0,0,0]
[null,0,0,0]
[null,0,0,0]
[null,0,0,0]
[null,0,0,0]
[null,0,0,0]
[null,0,0,0]
[null,0,0,0]
[null,0,0,0]
[null,0,0,0]
[null,0,0,0]
[null,0,0,0]
[null,0,0,0]
[null,0,0,0]
[null,0,0,0]
[null,0,0,0]
[null,0,0,0]
[null,0,0,0]
[null,0,0,0]
[null,0,0,0]
[null,0,0,0]
[null,0,0,0]
[null,0,0,0]
[null,0,0,0]
[null,0,0,0]
[null,0,0,0]
[null,0,0,0]
[null,0,0,0]
[null,0,0,0]
[null,0,0,0]
[null,0,0,0]
[null,0,0,0]
[null,0,0,0]
[null,0,0,0]
[null,0,0,0]
[null,0,0,0]
[null,0,0,0]
[null,0,0,0]
[null,0,0,0]
[null,0,0,0]
[null,0,0,0]
[null,0,0,0]
[null,0,0,0]
[null,0,0,0]
[null,0,0,0]
[null,0,0,0]
[null,0,0,0]
[null,0,0,0]
[null,0,0,0]
[null,0,0,0]
[null,0,0,0]
[null,0,0,{"$f":"B1674*C1674","v":0}]
[null,0,0,0]
[null,0,0,0]
[null,0,0,0]
[null,0,0,0]
[null,0,0,0]
[null,0,0,0]
[null,0,0,0]
[null,0,0,0]
[null,0,0,0]
[null,0,0,0]
[null,0,0,0]
[null,0,0,0]
[null,0,0,0]
[null,0,0,0]
[null,0,0,0]
[null,0,0,0]
[null,0,0,0]
[null,0,0,0]
[null,0,0,0]
[null,0,0,0]
[null,0,0,0]
[null,0,0,0]
[null,0,0,0]
[null,0,0,0]
[null,0,0,0]
[null,0,0,0]
[null,0,0,0]
[null,0,0,0]
[null,0,0,0]
[null,0,0,0]
[null,0,0,0]
[null,0,0,0]
[null,0,0,0]
[null,0,0,0]
[null,0,0,0]
[null,0,0,0]
[null,0,0,0]
[null,0,0,0]
[null,0,0,0]
[null,0,0,0]
[null,0,0,0]
[null,0,0,0]
[null,0,0,0]
[null,0,0,0]
[null,0,0,0]
[null,0,0,0]
[null,0,0,0]
[null,0,0,0]
[null,0,0,0]
[null,0,0,0]
[null,0,0,0]
[null,0,0,0]
[null,0,0,0]
[null,0,0,0]
[null,0,0,0]
[null,0,0,0]
[null,0,0,0]
[null,0,0,0]
[null,0,0,0]
[null,0,0,0]
[null,0,0,0]
[null,0,0,0]
[null,0,0,0]
[null,0,0,{"$f":"B1738*C1738","v":0}]
[null,0,0,0]
[null,0,0,0]
[null,0,0,0]
[null,0,0,0]
[null,0,0,0]
[null,0,0,0]
[null,0,0,0]
[null,0,0,0]
[null,0,0,0]
[null,0,0,0]
[null,0,0,0]
[null,0,0,0]
[null,0,0,0]
[null,0,0,0]
[null,0,0,0]
[null,0,0,0]
[null,0,0,0]
[null,0,0,0]
[null,0,0,0]
[null,0,0,0]
[null,0,0,0]
[null,0,0,0]
[null,0,0,0]
[null,0,0,0]
[null,0,0,0]
[null,0,0,0]
[null,0,0,0]
[null,0,0,0]
[null,0,0,0]
[null,0,0,0]
[null,0,0,0]
[null,0,0,0]
[null,0,0,0]
[null,0,0,0]
[null,0,0,0]
[null,0,0,0]
[null,0,0,0]
[null,0,0,0]
[null,0,0,0]
[null,0,0,0]
[null,0,0,0]
[null,0,0,0]
[null,0,0,0]
[null,0,0,0]
[null,0,0,0]
[null,0,0,0]
[null,0,0,0]
[null,0,0,0]
[null,0,0,0]
[null,0,0,0]
[null,0,0,0]
[null,0,0,0]
[null,0,0,0]
[null,0,0,0]
[null,0,0,0]
[null,0,0,0]
[null,0,0,0]
[null,0,0,0]
[null,0,0,0]
[null,0,0,0]
[null,0,0,0]
[null,0,0,0]
[null,0,0,0]
[null,0,0,{"$f":"B1802*C1802","v":0}]
[null,0,0,0]
[null,0,0,0]
[null,0,0,0]
[null,0,0,0]
[null,0,0,0]
[null,0,0,0]
[null,0,0,0]
[null,0,0,0]
[null,0,0,0]
[null,0,0,0]
[null,0,0,0]
[null,0,0,0]
[null,0,0,0]
[null,0,0,0]
[null,0,0,0]
[null,0,0,0]
[null,0,0,0]
[null,0,0,0]
[null,0,0,0]
[null,0,0,0]
[null,0,0,0]
[null,0,0,0]
[null,0,0,0]
[null,0,0,0]
[null,0,0,0]
[null,0,0,0]
[null,0,0,0]
[null,0,0,0]
[null,0,0,0]
[null,0,0,0]
[null,0,0,0]
[null,0,0,0]
[null,0,0,0]
[null,0,0,0]
[null,0,0,0]
[null,0,0,0]
[null,0,0,0]
[null,0,0,0]
[null,0,0,0]
[null,0,0,0]
[null,0,0,0]
[null,0,0,0]
[null,0,0,0]
[null,0,0,0]
[null,0,0,0]
[null,0,0,0]
[null,0,0,0]
[null,0,0,0]
[null,0,0,0]
[null,0,0,0]
[null,0,0,0]
[null,0,0,0]
[null,0,0,0]
[null,0,0,0]
[null,0,0,0]
[null,0,0,0]
[null,0,0,0]
[null,0,0,0]
[null,0,0,0]
[null,0,0,0]
[null,0,0,0]
[null,0,0,0]
[null,0,0,0]
[null,0,0,{"$f":"B1866*C1866","v":0}]
[null,0,0,0]
[null,0,0,0]
[null,0,0,0]
[null,0,0,0]
[null,0,0,0]
[null,0,0,0]
[null,0,0,0]
[null,0,0,0]
[null,0,0,0]
[null,0,0,0]
[null,0,0,0]
[null,0,0,0]
[null,0,0,0]
[null,0,0,0]
[null,0,0,0]
[null,0,0,0]
[null,0,0,0]
[null,0,0,0]
[null,0,0,0]
[null,0,0,0]
[null,0,0,0]
[null,0,0,0]
[null,0,0,0]
[null,0,0,0]
[null,0,0,0]
[null,0,0,0]
[null,0,0,0]
[null,0,0,0]
[null,0,0,0]
[null,0,0,0]
[null,0,0,0]
[null,0,0,0]
[null,0,0,0]
[null,0,0,0]
[null,0,0,0]
[null,0,0,0]
[null,0,0,0]
[null,0,0,0]
[null,0,0,0]
[null,0,0,0]
[null,0,0,0]
[null,0,0,0]
[null,0,0,0]
[null,0,0,0]
[null,0,0,0]
[null,0,0,0]
[null,0,0,0]
[null,0,0,0]
[null,0,0,0]
[null,0,0,0]
[null,0,0,0]
[null,0,0,0]
[null,0,0,0]
[null,0,0,0]
[null,0,0,0]
[null,0,0,0]
[null,0,0,0]
[null,0,0,0]
[null,0,0,0]
[null,0,0,0]
[null,0,0,0]
[null,0,0,0]
[null,0,0,0]
[null,0,0,{"$f":"B1930*C1930","v":0}]
[null,0,0,0]
[null,0,0,0]
[null,0,0,0]
[null,0,0,0]
[null,0,0,0]
[null,0,0,0]
[null,0,0,0]
[null,0,0,0]
[null,0,0,0]
[null,0,0,0]
[null,0,0,0]
[null,0,0,0]
[null,0,0,0]
[null,0,0,0]
[null,0,0,0]
[null,0,0,0]
[null,0,0,0]
[null,0,0,0]
[null,0,0,0]
[null,0,0,0]
[null,0,0,0]
[null,0,0,0]
[null,0,0,0]
[null,0,0,0]
[null,0,0,0]
[null,0,0,0]
[null,0,0,0]
[null,0,0,0]
[null,0,0,0]
[null,0,0,0]
[null,0,0,0]
[null,0,0,0]
[null,0,0,0]
[null,0,0,0]
[null,0,0,0]
[null,0,0,0]
[null,0,0,0]
[null,0,0,0]
[null,0,0,0]
[null,0,0,0]
[null,0,0,0]
[null,0,0,0]
[null,0,0,0]
[null,0,0,0]
[null,0,0,0]
[null,0,0,0]
[null,0,0,0]
[null,0,0,0]
[null,0,0,0]
[null,0,0,0]
[null,0,0,0]
[null,0,0,0]
[null,0,0,0]
[null,0,0,0]
[null,0,0,0]
[null,0,0,0]
[null,0,0,0]
[null,0,0,0]
[null,0,0,0]
[null,0,0,0]
[null,0,0,0]
[null,0,0,0]
[null,0,0,0]
[null,0,0,{"$f":"B1994*C1994","v":0}]
[null,0,0,0]
[null,0,0,0]
[null,0,0,0]
[null,0,0,0]
[null,0,0,0]
[null,0,0,0]
[null,0,0,0]
[null,0,0,0]
[null,0,0,0]
[null,0,0,0]
[null,0,0,0]
[null,0,0,0]
[null,0,0,0]
[null,0,0,0]
[null,0,0,0]
[null,0,0,0]
[null,0,0,0]
[null,0,0,0]
[null,0,0,0]
[null,0,0,0]
[null,0,0,0]
[null,0,0,0]
[null,0,0,0]
[null,0,0,0]
[null,0,0,0]
[null,0,0,0]
[null,0,0,0]
[null,0,0,0]
[null,0,0,0]
[null,0,0,0]
[null,0,0,0]
[null,0,0,0]
[null,0,0,0]
[null,0,0,0]
[null,0,0,0]
[null,0,0,0]
[null,0,0,0]
[null,0,0,0]
[null,0,0,0]
[null,0,0,0]
[null,0,0,0]
[null,0,0,0]
[null,0,0,0]
[null,0,0,0]
[null,0,0,0]
[null,0,0,0]
[null,0,0,0]
[null,0,0,0]
[null,0,0,0]
[null,0,0,0]
[null,0,0,0]
[null,0,0,0]
[null,0,0,0]
[null,0,0,0]
[null,0,0,0]
[null,0,0,0]
[null,0,0,0]
[null,0,0,0]
[null,0,0,0]
[null,0,0,0]
[null,0,0,0]
[null,0,0,0]
[null,0,0,0]
[null,0,0,{"$f":"B2058*C2058","v":0}]
[null,0,0,0]
[null,0,0,0]
[null,0,0,0]
[null,0,0,0]
[null,0,0,0]
[null,0,0,0]
[null,0,0,0]
[null,0,0,0]
[null,0,0,0]
[null,0,0,0]
[null,0,0,0]
[null,0,0,0]
[null,0,0,0]
[null,0,0,0]
[null,0,0,0]
[null,0,0,0]
[null,0,0,0]
[null,0,0,0]
[null,0,0,0]
[null,0,0,0]
[null,0,0,0]
[null,0,0,0]
[null,0,0,0]
[null,0,0,0]
[null,0,0,0]
[null,0,0,0]
[null,0,0,0]
[null,0,0,0]
[null,0,0,0]
[null,0,0,0]
[null,0,0,0]
[null,0,0,0]
[null,0,0,0]
[null,0,0,0]
[null,0,0,0]
[null,0,0,0]
[null,0,0,0]
[null,0,0,0]
[null,0,0,0]
[null,0,0,0]
[null,0,0,0]
[null,0,0,0]
[null,0,0,0]
[null,0,0,0]
[null,0,0,0]
[null,0,0,0]
[null,0,0,0]
[null,0,0,0]
[null,0,0,0]
[null,0,0,0]
[null,0,0,0]
[null,0,0,0]
[null,0,0,0]
[null,0,0,0]
[null,0,0,0]
[null,0,0,0]
[null,0,0,0]
[null,0,0,0]
[null,0,0,0]
[null,0,0,0]
[null,0,0,0]
[null,0,0,0]
[null,0,0,0]
[null,0,0,{"$f":"B2122*C2122","v":0}]
[null,0,0,0]
[null,0,0,0]
[null,0,0,0]
[null,0,0,0]
[null,0,0,0]
[null,0,0,0]
[null,0,0,0]
[null,0,0,0]
[null,0,0,0]
[null,0,0,0]
[null,0,0,0]
[null,0,0,0]
[null,0,0,0]
[null,0,0,0]
[null,0,0,0]
[null,0,0,0]
[null,0,0,0]
[null,0,0,0]
[null,0,0,0]
[null,0,0,0]
[null,0,0,0]
[null,0,0,0]
[null,0,0,0]
[null,0,0,0]
[null,0,0,0]
[null,0,0,0]
[null,0,0,0]
[null,0,0,0]
[null,0,0,0]
[null,0,0,0]
[null,0,0,0]
[null,0,0,0]
[null,0,0,0]
[null,0,0,0]
[null,0,0,0]
[null,0,0,0]
[null,0,0,0]
[null,0,0,0]
[null,0,0,0]
[null,0,0,0]
[null,0,0,0]
[null,0,0,0]
[null,0,0,0]
[null,0,0,0]
[null,0,0,0]
[null,0,0,0]
[null,0,0,0]
[null,0,0,0]
[null,0,0,0]
[null,0,0,0]
[null,0,0,0]
[null,0,0,0]
[null,0,0,0]
[null,0,0,0]
[null,0,0,0]
[null,0,0,0]
[null,0,0,0]
[null,0,0,0]
[null,0,0,0]
[null,0,0,0]
[null,0,0,0]
[null,0,0,0]
[null,0,0,0]
[null,0,0,{"$f":"B2186*C2186","v":0}]
[null,0,0,0]
[null,0,0,0]
[null,0,0,0]
[null,0,0,0]
[null,0,0,0]
[null,0,0,0]
[null,0,0,0]
[null,0,0,0]
[null,0,0,0]
[null,0,0,0]
[null,0,0,0]
[null,0,0,0]
[null,0,0,0]
[null,0,0,0]
[null,0,0,0]
[null,0,0,0]
[null,0,0,0]
[null,0,0,0]
[null,0,0,0]
[null,0,0,0]
[null,0,0,0]
[null,0,0,0]
[null,0,0,0]
[null,0,0,0]
[null,0,0,0]
[null,0,0,0]
[null,0,0,0]
[null,0,0,0]
[null,0,0,0]
[null,0,0,0]
[null,0,0,0]
[null,0,0,0]
[null,0,0,0]
[null,0,0,0]
[null,0,0,0]
[null,0,0,0]
[null,0,0,0]
[null,0,0,0]
[null,0,0,0]
[null,0,0,0]
[null,0,0,0]
[null,0,0,0]
[null,0,0,0]
[null,0,0,0]
[null,0,0,0]
[null,0,0,0]
[null,0,0,0]
[null,0,0,0]
[null,0,0,0]
[null,0,0,0]
[null,0,0,0]
[null,0,0,0]
[null,0,0,0]
[null,0,0,0]
[null,0,0,0]
[null,0,0,0]
[null,0,0,0]
[null,0,0,0]
[null,0,0,0]
[null,0,0,0]
[null,0,0,0]
[null,0,0,0]
[null,0,0,0]
[null,0,0,{"$f":"B2250*C2250","v":0}]
[null,0,0,0]
[null,0,0,0]
[null,0,0,0]
[null,0,0,0]
[null,0,0,0]
[null,0,0,0]
[null,0,0,0]
[null,0,0,0]
[null,0,0,0]
[null,0,0,0]
[null,0,0,0]
[null,0,0,0]
[null,0,0,0]
[null,0,0,0]
[null,0,0,0]
[null,0,0,0]
[null,0,0,0]
[null,0,0,0]
[null,0,0,0]
[null,0,0,0]
[null,0,0,0]
[null,0,0,0]
[null,0,0,0]
[null,0,0,0]
[null,0,0,0]
[null,0,0,0]
[null,0,0,0]
[null,0,0,0]
[null,0,0,0]
[null,0,0,0]
[null,0,0,0]
[null,0,0,0]
[null,0,0,0]
[null,0,0,0]
[null,0,0,0]
[null,0,0,0]
[null,0,0,0]
[null,0,0,0]
[null,0,0,0]
[null,0,0,0]
[null,0,0,0]
[null,0,0,0]
[null,0,0,0]
[null,0,0,0]
[null,0,0,0]
[null,0,0,0]
[null,0,0,0]
[null,0,0,0]
[null,0,0,0]
[null,0,0,0]
[null,0,0,0]
[null,0,0,0]
[null,0,0,0]
[null,0,0,0]
[null,0,0,0]
[null,0,0,0]
[null,0,0,0]
[null,0,0,0]
[null,0,0,0]
[null,0,0,0]
[null,0,0,0]
[null,0,0,0]
[null,0,0,0]
[null,0,0,{"$f":"B2314*C2314","v":0}]
[null,0,0,0]
[null,0,0,0]
[null,0,0,0]
[null,0,0,0]
[null,0,0,0]
[null,0,0,0]
[null,0,0,0]
[null,0,0,0]
[null,0,0,0]
[null,0,0,0]
[null,0,0,0]
[null,0,0,0]
[null,0,0,0]
[null,0,0,0]
[null,0,0,0]
[null,0,0,0]
[null,0,0,0]
[null,0,0,0]
[null,0,0,0]
[null,0,0,0]
[null,0,0,0]
[null,0,0,0]
[null,0,0,0]
[null,0,0,0]
[null,0,0,0]
[null,0,0,0]
[null,0,0,0]
[null,0,0,0]
[null,0,0,0]
[null,0,0,0]
[null,0,0,0]
[null,0,0,0]
[null,0,0,0]
[null,0,0,0]
[null,0,0,0]
[null,0,0,0]
[null,0,0,0]
[null,0,0,0]
[null,0,0,0]
[null,0,0,0]
[null,0,0,0]
[null,0,0,0]
[null,0,0,0]
[null,0,0,0]
[null,0,0,0]
[null,0,0,0]
[null,0,0,0]
[null,0,0,0]
[null,0,0,0]
[null,0,0,0]
[null,0,0,0]
[null,0,0,0]
[null,0,0,0]
[null,0,0,0]
[null,0,0,0]
[null,0,0,0]
[null,0,0,0]
[null,0,0,0]
[null,0,0,0]
[null,0,0,0]
[null,0,0,0]
[null,0,0,0]
[null,0,0,0]
[null,0,0,{"$f":"B2378*C2378","v":0}]
[null,0,0,0]
[null,0,0,0]
[null,0,0,0]
[null,0,0,0]
[null,0,0,0]
[null,0,0,0]
[null,0,0,0]
[null,0,0,0]
[null,0,0,0]
[null,0,0,0]
[null,0,0,0]
[null,0,0,0]
[null,0,0,0]
[null,0,0,0]
[null,0,0,0]
[null,0,0,0]
[null,0,0,0]
[null,0,0,0]
[null,0,0,0]
[null,0,0,0]
[null,0,0,0]
[null,0,0,0]
[null,0,0,0]
[null,0,0,0]
[null,0,0,0]
[null,0,0,0]
[null,0,0,0]
[null,0,0,0]
[null,0,0,0]
[null,0,0,0]
[null,0,0,0]
[null,0,0,0]
[null,0,0,0]
[null,0,0,0]
[null,0,0,0]
[null,0,0,0]
[null,0,0,0]
[null,0,0,0]
[null,0,0,0]
[null,0,0,0]
[null,0,0,0]
[null,0,0,0]
[null,0,0,0]
[null,0,0,0]
[null,0,0,0]
[null,0,0,0]
[null,0,0,0]
[null,0,0,0]
[null,0,0,0]
[null,0,0,0]
[null,0,0,0]
[null,0,0,0]
[null,0,0,0]
[null,0,0,0]
[null,0,0,0]
[null,0,0,0]
[null,0,0,0]
[null,0,0,0]
[null,0,0,0]
[null,0,0,0]
[null,0,0,0]
[null,0,0,0]
[null,0,0,0]
[null,0,0,{"$f":"B2442*C2442","v":0}]
[null,0,0,0]
[null,0,0,0]
[null,0,0,0]
[null,0,0,0]
[null,0,0,0]
[null,0,0,0]
[null,0,0,0]
[null,0,0,0]
[null,0,0,0]
[null,0,0,0]
[null,0,0,0]
[null,0,0,0]
[null,0,0,0]
[null,0,0,0]
[null,0,0,0]
[null,0,0,0]
[null,0,0,0]
[null,0,0,0]
[null,0,0,0]
[null,0,0,0]
[null,0,0,0]
[null,0,0,0]
[null,0,0,0]
[null,0,0,0]
[null,0,0,0]
[null,0,0,0]
[null,0,0,0]
[null,0,0,0]
[null,0,0,0]
[null,0,0,0]
[null,0,0,0]
[null,0,0,0]
[null,0,0,0]
[null,0,0,0]
[null,0,0,0]
[null,0,0,0]
[null,0,0,0]
[null,0,0,0]
[null,0,0,0]
[null,0,0,0]
[null,0,0,0]
[null,0,0,0]
[null,0,0,0]
[null,0,0,0]
[null,0,0,0]
[null,0,0,0]
[null,0,0,0]
[null,0,0,0]
[null,0,0,0]
[null,0,0,0]
[null,0,0,0]
[null,0,0,0]
[null,0,0,0]
[null,0,0,0]
[null,0,0,0]
[null,0,0,0]
[null,0,0,0]
[null,0,0,0]
[null,0,0,0]
[null,0,0,0]
[null,0,0,0]
[null,0,0,0]
[null,0,0,0]
[null,0,0,{"$f":"B2506*C2506","v":0}]
[null,0,0,0]
[null,0,0,0]
[null,0,0,0]
[null,0,0,0]
[null,0,0,0]
[null,0,0,0]
[null,0,0,0]
[null,0,0,0]
[null,0,0,0]
[null,0,0,0]
[null,0,0,0]
[null,0,0,0]
[null,0,0,0]
[null,0,0,0]
[null,0,0,0]
[null,0,0,0]
[null,0,0,0]
[null,0,0,0]
[null,0,0,0]
[null,0,0,0]
[null,0,0,0]
[null,0,0,0]
[null,0,0,0]
[null,0,0,0]
[null,0,0,0]
[null,0,0,0]
[null,0,0,0]
[null,0,0,0]
[null,0,0,0]
[null,0,0,0]
[null,0,0,0]
[null,0,0,0]
[null,0,0,0]
[null,0,0,0]
[null,0,0,0]
[null,0,0,0]
[null,0,0,0]
[null,0,0,0]
[null,0,0,0]
[null,0,0,0]
[null,0,0,0]
[null,0,0,0]
[null,0,0,0]
[null,0,0,0]
[null,0,0,0]
[null,0,0,0]
[null,0,0,0]
[null,0,0,0]
[null,0,0,0]
[null,0,0,0]
[null,0,0,0]
[null,0,0,0]
[null,0,0,0]
[null,0,0,0]
[null,0,0,0]
[null,0,0,0]
[null,0,0,0]
[null,0,0,0]
[null,0,0,0]
[null,0,0,0]
[null,0,0,0]
[null,0,0,0]
[null,0,0,0]
[null,0,0,{"$f":"B2570*C2570","v":0}]
[null,0,0,0]
[null,0,0,0]
[null,0,0,0]
[null,0,0,0]
[null,0,0,0]
[null,0,0,0]
[null,0,0,0]
[null,0,0,0]
[null,0,0,0]
[null,0,0,0]
[null,0,0,0]
[null,0,0,0]
[null,0,0,0]
[null,0,0,0]
[null,0,0,0]
[null,0,0,0]
[null,0,0,0]
[null,0,0,0]
[null,0,0,0]
[null,0,0,0]
[null,0,0,0]
[null,0,0,0]
[null,0,0,0]
[null,0,0,0]
[null,0,0,0]
[null,0,0,0]
[null,0,0,0]
[null,0,0,0]
[null,0,0,0]
[null,0,0,0]
[null,0,0,0]
[null,0,0,0]

{"sheet":"Step2","index":3,"n_rows":43,"n_cols":13,"rows_kept":43,"cut":false,"hidden":false,"merged":[[5,3,5,4],[10,0,10,2],[15,0,15,3],[30,0,30,2],[25,1,25,3],[26,1,26,3],[27,1,27,3],[12,0,12,11],[32,0,32,11],[17,0,17,11],[20,1,20,3],[21,1,21,3],[22,1,22,3]]}
[]
["Forensic Light Source Health risk composite index",null,null,null,null,null,null,null,null,null,null,null,"Laser"]
[null,null,null,null,null,null,null,null,null,null,null,null,"Forensic light source"]
["Use this section to calculate the Health risk composite index you want to assess"]
[]
[null,null,"Health risk for :"]
[]
[]
[null,null,null,"=",{"$f":"IFERROR((IF((M13=0),0,E11*F16*E31)),\"Waiting for data\")","v":"Waiting for data"},"=","Health risk composite index"]
[]
["Danger index",null,null,"=",{"$f":"IFERROR((IF(D6=$M$3,(10^M13),IF(D6=$M$2,(10^(M13-1)),\"Waiting for data\"))),\"Waiting for data\")","v":"Waiting for data"}]
[]
[{"$f":"IF(D6=$M$3,(\"Please enter the IEC/EN 62471 class number of your forensic light source\"),IF(D6=$M$2,(\"Please enter the Laser class number of your laser source\"),\"Waiting for data\"))","v":"Waiting for data"},null,null,null,null,null,null,null,null,null,null,null,"Enter data"]
["Reference: ",{"$f":"IF(D6=$M$3,(HYPERLINK(\"https://webstore.iec.ch/publication/7076\")),IF(D6=$M$2,(HYPERLINK(\"http://www.lasersafetyfacts.com/laserclasses.html\")),\"Waiting for data\"))","v":"Waiting for data"}]
[]
["Exposition index",null,null,null,"=",{"$f":"IFERROR((IF(H16>=0.9,1,H16)),\"Waiting for data\")","v":"Waiting for data"},null,{"$f":"0.1*D20*D25","v":{"$error":"#VALUE!"}}]
[]
["Please enter the appropriate rank using the tables associated"]
[]
["Level of frequency",null,"=","Enter data"]
["Level 1","Less than once a week"]
["Level 2","Once or more times per week"]
["Level 3","Once or more times per day"]
[]
["Operating Environment",null,"=","Enter data"]
["Level 1","Controlled environment with restricted access"]
["Level 2","Controlled environment with unrestricted access"]
["Level 3","Uncontrolled environment"]
[]
[]
["Protection index",null,null,"=",{"$f":"IFERROR((10^-(I40-1)),\"Waiting for data\")","v":"Waiting for data"}]
[]
["Please enter the lowest protection level reached using the table below"]
[]
["Skin Protection",null,"=","Enter data"]
["Level 1","No gloves/lab coat/protection clothes"]
["Level 2","Unsuitable gloves/lab coat/protection clothes"]
["Level 3","Suitable gloves/lab coat/protection clothes"]
[]
["Eyes Protection",null,"=","Enter data",null,"Lowest protection level ",null,"=",{"$f":"IF(D35<=D40,D35,D40)","v":"Enter data"}]
["Level 1","No protection"]
["Level 2","Unsuitable goggle/glasses"]
["Level 3","Suitable goggle/glasses"]

{"sheet":"Step3","index":4,"n_rows":16,"n_cols":12,"rows_kept":16,"cut":false,"hidden":false,"merged":[[9,8,9,10],[11,8,11,10],[12,8,12,10],[13,8,13,10],[9,1,9,3],[10,1,10,3],[11,1,11,3],[12,1,12,3],[13,1,13,3],[10,8,10,10],[1,2,1,3],[6,7,6,12],[6,0,6,5],[8,1,8,3],[8,8,8,10]]}
[]
["Time index","=",{"$f":"IFERROR((0.5*D16)+(0.5*K16),\"Waiting for data\")","v":"Waiting for data"}]
[]
["Please select the appropriate value using the time scales below"]
[]
["Preparation time",null,"=",null,{"$f":"VLOOKUP(D6,$E$10:$F$14,2,FALSE)","v":{"$error":"#N/A"}},null,null,"Processing Time",null,"=",null,{"$f":"VLOOKUP(K6,$E$10:$F$14,2,FALSE)","v":{"$error":"#N/A"}}]
["The time required for the preparation of different solutions for a method",null,null,null,null,null,null,"The time required during treatment, referring to the treatment itself but also reaction time, the drying time, the manipulation time and so on"]
[]
["Time scale","Definition",null,null,null,null,null,"Time scale","Definition"]
[5,"Very fast",null,null,{"$f":"B10","v":"Very fast"},5,null,5,"Very fast"]
[4,"Fast",null,null,{"$f":"B11","v":"Fast"},4,null,4,"Fast"]
[3,"Not really time consuming",null,null,"Not really time consuming",3,null,3,"Not really time consuming"]
[2,"Time consuming",null,null,"Time consuming",2,null,2,"Time consuming"]
[1,"Very time consuming",null,null,"Very time consuming",1,null,1,"Very time consuming"]
[]
["Preparation time index",null,"=",{"$f":"IFERROR((10^(E6-2)),\"Waiting for data\")","v":"Waiting for data"},null,null,null,"Processing time index",null,"=",{"$f":"IFERROR((10^(L6-2)),\"Waiting for data\")","v":"Waiting for data"}]

{"sheet":"Step4","index":5,"n_rows":19,"n_cols":13,"rows_kept":19,"cut":false,"hidden":false,"merged":[[16,1,16,3],[15,8,15,10],[16,8,16,10],[10,1,10,3],[10,8,10,10],[11,1,11,3],[11,8,11,10],[12,1,12,3],[12,8,12,10],[13,1,13,3],[13,8,13,10],[14,1,14,3],[14,8,14,10],[15,1,15,3],[1,0,1,1],[7,0,7,5],[7,7,7,13],[9,1,9,3],[9,8,9,10],[6,3,6,4],[6,10,6,11]]}
[]
["Simplicity Index",null,"=",{"$f":"IFERROR(((0.5*D19)+(0.5*K19)),\"Waiting for data\")","v":"Waiting for data"}]
[]
[]
["Please select the appropriate value using the simplicity scales below"]
[]
["Preparation Simplicity",null,"=",null,null,{"$f":"IFERROR(VLOOKUP(D7,$E$11:$F$17,2,FALSE),\"\")","v":""},null,"Processing Simplicity",null,"=",null,null,{"$f":"IFERROR(VLOOKUP(K7,$L$11:$M$17,2,FALSE),\"\")","v":""}]
["The simplicity of the preparation of the forensic light source before power ON",null,null,null,null,null,null,"Ease of use of a method during treatment, referring to the treatment itself but also to the preparation of the surface, the manipulation and so on"]
[]
["Simplicity scale","Definition",null,null,null,null,null,"Simplicity scale","Definition"]
[3,"Extremely easy and simple to prepare",null,null,{"$f":"B11","v":"Extremely easy and simple to prepare"},{"$f":"A11","v":3},null,3,"Extremely easy and simple to use",null,null,{"$f":"I11","v":"Extremely easy and simple to use"},{"$f":"H11","v":3}]
[2,"Very easy and simple to prepare",null,null,{"$f":"B12","v":"Very easy and simple to prepare"},{"$f":"A12","v":2},null,2,"Very easy and simple to use",null,null,{"$f":"I12","v":"Very easy and simple to use"},{"$f":"H12","v":2}]
[1,"Easy and simple to prepare",null,null,"Easy and simple to prepare",1,null,1,"Easy and simple to use",null,null,"Easy and simple to use",1]
[0,"Not difficult to prepare",null,null,"Not difficult to prepare",0,null,0,"Not difficult to use",null,null,"Not difficult to use",0]
[-1,"Complex and difficult to prepare",null,null,"Complex and difficult to prepare",-1,null,-1,"Complex and difficult to use",null,null,"Complex and difficult to use",-1]
[-2,"Very complex and difficult to prepare",null,null,"Very complex and difficult to prepare",-2,null,-2,"Very complex and difficult to use",null,null,"Very complex and difficult to use",-2]
[-3,"Extremely complex and difficult to prepare",null,null,"Extremely complex and difficult to prepare",-3,null,-3,"Extremely complex and difficult to use",null,null,"Extremely complex and difficult to use",-3]
[]
["Preparation simplicity index",null,"=",{"$f":"IFERROR((10^(F7)),\"Waiting for data\")","v":"Waiting for data"},null,null,null,"Processing simplicity index",null,"=",{"$f":"IFERROR((10^(M7)),\"Waiting for data\")","v":"Waiting for data"}]

{"sheet":"ForATE Index","index":6,"n_rows":9,"n_cols":11,"rows_kept":9,"cut":false,"hidden":false,"merged":[[1,0,1,1],[2,0,2,1],[1,3,1,9]]}
[]
["ForATE index",null,"=",{"$f":"IFERROR((C6*B6)-(C7*B7)+(C7*1000)+(C8*B8)+(C9*B9),\"Waiting for data\")","v":"Waiting for data"},null,null,null,null,null,null,{"$f":"(0.6634*D2)+0.005","v":{"$error":"#VALUE!"}}]
["Forensic light source technology"]
[]
[null,"Individual indexes values","Individual indexes weight"]
["Efficiency",{"$f":"Step1!D2","v":"Waiting for data"},0.66339999999999999]
["Health Risk",{"$f":"Step2!E9","v":"Waiting for data"},0.24759999999999999]
["Time",{"$f":"Step3!C2","v":"Waiting for data"},4.58E-2]
["Simplicity",{"$f":"Step4!D2","v":"Waiting for data"},4.3200000000000002E-2]

{"sheet":"Print","index":7,"n_rows":13,"n_cols":5,"rows_kept":13,"cut":false,"hidden":false,"merged":[[3,2,3,4],[4,2,4,4]]}
[]
[]
[]
[null,null,"ForATE index"]
[null,null,"Forensic light source technology"]
[]
[null,null,null,{"$f":"'ForATE Index'!D2:J2","v":"Waiting for data"}]
[]
[null,null,null,"Individual indexes values","Individual indexes weight"]
[null,null,"Efficiency",{"$f":"'ForATE Index'!B6","v":"Waiting for data"},0.66339999999999999]
[null,null,"Health Risk",{"$f":"'ForATE Index'!B7","v":"Waiting for data"},0.24759999999999999]
[null,null,"Time",{"$f":"'ForATE Index'!B8","v":"Waiting for data"},4.58E-2]
[null,null,"Simplicity",{"$f":"'ForATE Index'!B9","v":"Waiting for data"},4.3200000000000002E-2]

{"sheet":"Liste","index":8,"n_rows":75,"n_cols":14,"rows_kept":75,"cut":false,"hidden":true,"merged":[]}
[null,null,"y","x",null,null,null,null,null,"EUH014",null,null,"ForATE"]
[null,null,1,0,null,null,null,null,null,"EUH019",null,0,{"$f":"0.005+0","v":5.0000000000000001E-3},0]
[null,null,{"$f":"LOG(D3)","v":1.6989700043360187},50,null,null,null,null,null,"EUH044",null,50,{"$f":"33.175+0","v":33.174999999999997},-110]
[null,null,2,100,null,null,null,null,null,"EUH066",null,100,{"$f":"66.345+0","v":66.344999999999999},-20]
[null,null,2.1760912590556813,150,null,null,null,null,null,"H204",null,150,{"$f":"99.515+0","v":99.515000000000001},1E-3]
[null,null,2.3010299956639813,200,null,null,null,null,null,"H205",null,200,{"$f":"132.685+0","v":132.685},2E-3]
[null,null,2.3979400086720375,250,null,null,null,null,null,"H226",null,250,{"$f":"165.855+0","v":165.85499999999999},4.0000000000000001E-3]
[null,null,2.4771212547196626,300,null,null,null,null,null,"H228",null,300,{"$f":"199.025+0","v":199.02500000000001},1]
[null,null,2.5440680443502757,350,null,null,null,null,null,"H252",null,350,{"$f":"232.195+0","v":232.19499999999999},8]
[null,null,2.6020599913279625,400,null,null,null,null,null,"H270",null,400,{"$f":"265.365+0","v":265.36500000000001},20]
[null,null,2.6532125137753435,450,null,null,null,null,null,"H272",null,450,{"$f":"298.535+0","v":298.53500000000003},50]
[null,null,2.6989700043360187,500,null,null,null,null,null,"H302",null,500,{"$f":"331.705+0","v":331.70499999999998},100]
[null,null,2.7403626894942437,550,null,null,null,null,null,"H304",null,550,{"$f":"364.875+0","v":364.875},300]
[null,null,2.7781512503836434,600,null,null,null,null,null,"H312",null,600,{"$f":"398.045+0","v":398.04500000000002},400]
[null,null,2.8129133566428557,650,null,null,null,null,null,"H315",null,650,{"$f":"431.215+0","v":431.21499999999997},600]
[null,null,2.8450980400142569,700,null,null,null,null,null,"H319",null,700,{"$f":"464.385+0","v":464.38499999999999},752.4]
[null,null,2.8750612633917001,750,null,null,null,null,null,"H332",null,750,{"$f":"497.555+0","v":497.55500000000001}]
[null,null,2.9030899869919438,800,null,null,null,null,null,"H336",null,800,{"$f":"530.725+0","v":530.72500000000002}]
[null,null,2.9294189257142929,850,null,null,null,null,null,"EUH006",null,850,{"$f":"563.895+0","v":563.89499999999998}]
[null,null,2.9542425094393248,900,null,null,null,null,null,"EUH018",null,900,{"$f":"597.065+0","v":597.06500000000005}]
[null,null,2.9777236052888476,950,null,null,null,null,null,"EUH029",null,950,{"$f":"630.235+0","v":630.23500000000001}]
[null,null,3,1000,null,null,null,null,null,"EUH031",null,1000,{"$f":"663.405+0","v":663.40499999999997}]
[null,null,null,null,null,null,null,null,null,"EUH071",null,1050,{"$f":"M22+33.17","v":696.57499999999993}]
[null,null,null,null,null,null,null,null,null,"H201",null,1100,{"$f":"M23+33.17","v":729.74499999999989}]
[null,null,null,null,null,null,null,null,null,"H203",null,1150,{"$f":"M24+33.17","v":762.91499999999985}]
[null,null,null,null,null,null,null,null,null,"H225",null,1200,{"$f":"M25+33.17","v":796.08499999999981}]
[null,null,null,null,null,null,null,null,null,"H240",null,1250,829.25499999999977]
[null,null,null,null,null,null,null,null,null,"H241",null,1300,862.42499999999973]
[null,null,null,null,null,null,null,null,null,"H251",null,1350,895.59499999999969]
[null,null,null,null,null,null,null,null,null,"H261",null,1400,928.76499999999965]
[null,null,null,null,null,null,null,null,null,"H271",null,1450,961.9349999999996]
[null,null,null,null,null,null,null,null,null,"H301",null,1500,995.10499999999956]
[null,null,null,null,null,null,null,null,null,"H311"]
[null,null,null,null,null,null,null,null,null,"H317"]
[null,null,null,null,null,null,null,null,null,"H331"]
[null,null,null,null,null,null,null,null,null,"H335"]
[null,null,null,null,null,null,null,null,null,"H341"]
[null,null,null,null,null,null,null,null,null,"H351"]
[null,null,null,null,null,null,null,null,null,"H361"]
[null,null,null,null,null,null,null,null,null,"H361d"]
[null,null,null,null,null,null,null,null,null,"H361f"]
[null,null,null,null,null,null,null,null,null,"H361fd"]
[null,null,null,null,null,null,null,null,null,"H362"]
[null,null,null,null,null,null,null,null,null,"H371"]
[null,null,null,null,null,null,null,null,null,"EUH001"]
[null,null,null,null,null,null,null,null,null,"EUH032"]
[null,null,null,null,null,null,null,null,null,"EUH070"]
[null,null,null,null,null,null,null,null,null,"H200"]
[null,null,null,null,null,null,null,null,null,"H202"]
[null,null,null,null,null,null,null,null,null,"H220"]
[null,null,null,null,null,null,null,null,null,"H221"]
[null,null,null,null,null,null,null,null,null,"H222"]
[null,null,null,null,null,null,null,null,null,"H223"]
[null,null,null,null,null,null,null,null,null,"H224"]
[null,null,null,null,null,null,null,null,null,"H242"]
[null,null,null,null,null,null,null,null,null,"H250"]
[null,null,null,null,null,null,null,null,null,"H260"]
[null,null,null,null,null,null,null,null,null,"H300"]
[null,null,null,null,null,null,null,null,null,"H310"]
[null,null,null,null,null,null,null,null,null,"H314"]
[null,null,null,null,null,null,null,null,null,"H318"]
[null,null,null,null,null,null,null,null,null,"H330"]
[null,null,null,null,null,null,null,null,null,"H334"]
[null,null,null,null,null,null,null,null,null,"H340"]
[null,null,null,null,null,null,null,null,null,"H350"]
[null,null,null,null,null,null,null,null,null,"H350i"]
[null,null,null,null,null,null,null,null,null,"H360"]
[null,null,null,null,null,null,null,null,null,"H360D"]
[null,null,null,null,null,null,null,null,null,"H360Df"]
[null,null,null,null,null,null,null,null,null,"H360F"]
[null,null,null,null,null,null,null,null,null,"H360Fd"]
[null,null,null,null,null,null,null,null,null,"H360FD"]
[null,null,null,null,null,null,null,null,null,"H370"]
[null,null,null,null,null,null,null,null,null,"H372"]
[null,null,null,null,null,null,null,null,null,"H373"]